![]() |
| Summary | |
|---|---|
| Suite / Plan | TVTS / tvts-cert |
| Suite / Build | 2.8_r2 / P66353907 |
| Host Info | Result/@start dev2google04-MINIPC-PN50 (Linux - 6.5.0-28-generic) |
| Start time / End Time | Fri May 03 12:29:35 KST 2024 / Fri May 03 16:35:10 KST 2024 |
| Tests Passed | 0 |
| Tests Failed | 1 |
| Modules Done | 1 |
| Modules Total | 1 |
| Fingerprint | SKB/BFX_AT100/BFX-AT100:12/STTC.220724.001/15.537.512-20240321:user/release-keys |
| Security Patch | 2024-02-01 |
| Release (SDK) | 12 (31) |
| ABIs | armeabi-v7a,armeabi |
| Module | Passed | Failed | Assumption Failure | Ignored | Total Tests | Done | Reason |
|---|---|---|---|---|---|---|---|
| armeabi-v7a TvtsYouTubeTS | 0 | 1 | 1083 | 0 | 1084 | true |
| armeabi-v7a TvtsYouTubeTS | ||
| Test | Result | Details |
|---|---|---|
| com.google.android.apps.yts.tvts.TvtsYouTubeTS#testYTS |
fail
|
java.lang.AssertionError: Test run incomplete. 60 YouTube tests were not run
at org.junit.Assert.fail(Assert.java:89)
at com.google.android.apps.yts.tvts.TvtsYouTubeTS.tearDown(TvtsYouTubeTS.java:285)
at java.base/jdk.internal.reflect.NativeMethodAccessorImpl.invoke0(Native Method)
at java.base/jdk.internal.reflect.NativeMethodAccessorImpl.invoke(NativeMethodAccessorImpl.java:77)
at java.base/jdk.internal.reflect.DelegatingMethodAccessorImpl.invoke(DelegatingMethodAccessorImpl.java:43)
at java.base/java.lang.reflect.Method.invoke(Method.java:568)
at org.junit.runners.model.FrameworkMethod$1.runReflectiveCall(FrameworkMethod.java:59)
at org.junit.internal.runners.model.ReflectiveCallable.run(ReflectiveCallable.java:12)
at org.junit.runners.model.FrameworkMethod.invokeExplosively(FrameworkMethod.java:61)
at org.junit.internal.runners.statements.RunAfters.invokeMethod(RunAfters.java:46)
at org.junit.internal.runners.statements.RunAfters.evaluate(RunAfters.java:33)
at org.junit.rules.ExternalResource$1.evaluate(ExternalResource.java:54)
at org.junit.rules.ExternalResource$1.evaluate(ExternalResource.java:54)
at org.junit.rules.TestWatcher$1.evaluate(TestWatcher.java:61)
at org.junit.runners.ParentRunner$3.evaluate(ParentRunner.java:306)
at org.junit.runners.BlockJUnit4ClassRunner$1.evaluate(BlockJUnit4ClassRunner.java:100)
at org.junit.runners.ParentRunner.runLeaf(ParentRunner.java:366)
at org.junit.runners.BlockJUnit4ClassRunner.runChild(BlockJUnit4ClassRunner.java:103)
at com.android.tradefed.testtype.DeviceJUnit4ClassRunner.runChild(DeviceJUnit4ClassRunner.java:111)
at com.android.tradefed.testtype.DeviceJUnit4ClassRunner.runChild(DeviceJUnit4ClassRunner.java:63)
at org.junit.runners.ParentRunner$4.run(ParentRunner.java:331)
at org.junit.runners.ParentRunner$1.schedule(ParentRunner.java:79)
at org.junit.runners.ParentRunner.runChildren(ParentRunner.java:329)
at org.junit.runners.ParentRunner$2.evaluate(ParentRunner.java:293)
at org.junit.runners.ParentRunner$3.evaluate(ParentRunner.java:306)
at org.junit.runners.ParentRunner.run(ParentRunner.java:413)
at com.android.tradefed.testtype.DeviceJUnit4ClassRunner.run(DeviceJUnit4ClassRunner.java:147)
at com.android.tradefed.testtype.junit4.ExceptionThrowingRunnerWrapper.run(ExceptionThrowingRunnerWrapper.java:43)
at org.junit.runner.JUnitCore.run(JUnitCore.java:137)
at com.android.tradefed.testtype.HostTest.runJUnit4Tests(HostTest.java:736)
at com.android.tradefed.testtype.HostTest.runTestClasses(HostTest.java:616)
at com.android.tradefed.testtype.HostTest.run(HostTest.java:564)
at com.android.tradefed.testtype.suite.GranularRetriableTestWrapper.intraModuleRun(GranularRetriableTestWrapper.java:379)
at com.android.tradefed.testtype.suite.GranularRetriableTestWrapper.run(GranularRetriableTestWrapper.java:289)
at com.android.tradefed.testtype.suite.ModuleDefinition.run(ModuleDefinition.java:595)
at com.android.tradefed.testtype.suite.ITestSuite.runSingleModule(ITestSuite.java:951)
at com.android.tradefed.testtype.suite.ITestSuite.run(ITestSuite.java:828)
at com.android.tradefed.invoker.InvocationExecution.runTest(InvocationExecution.java:1361)
at com.android.tradefed.invoker.InvocationExecution.runTests(InvocationExecution.java:1140)
at com.android.tradefed.invoker.TestInvocation.prepareAndRun(TestInvocation.java:632)
at com.android.tradefed.invoker.TestInvocation.performInvocation(TestInvocation.java:281)
at com.android.tradefed.invoker.TestInvocation.invoke(TestInvocation.java:1363)
at com.android.tradefed.command.CommandScheduler$InvocationThread.run(CommandScheduler.java:677)
|
| armeabi-v7a TvtsYouTubeTS | ||
| Test | Result | Details |
|---|---|---|
| com.google.android.apps.yts.tvts.YtsReport#yts[AV1SFRTestsAV1SFRPlaybackPerformancePlaybackPerfAV1.1080p.30fps@0.25X-9.2.13.1] |
ASSUMPTION_FAILURE
|
org.junit.AssumptionViolatedException: Test not enforced
|
| com.google.android.apps.yts.tvts.YtsReport#yts[AV1SFRTestsAV1SFRPlaybackPerformancePlaybackPerfAV1.1080p.30fps@0.5X-9.2.14.1] |
ASSUMPTION_FAILURE
|
org.junit.AssumptionViolatedException: Test not enforced
|
| com.google.android.apps.yts.tvts.YtsReport#yts[AV1SFRTestsAV1SFRPlaybackPerformancePlaybackPerfAV1.1080p.30fps@0.75X-9.2.15.1] |
ASSUMPTION_FAILURE
|
org.junit.AssumptionViolatedException: Test not enforced
|
| com.google.android.apps.yts.tvts.YtsReport#yts[AV1SFRTestsAV1SFRPlaybackPerformancePlaybackPerfAV1.1080p.30fps@1.25X-9.2.17.1] |
ASSUMPTION_FAILURE
|
org.junit.AssumptionViolatedException: Test not enforced
|
| com.google.android.apps.yts.tvts.YtsReport#yts[AV1SFRTestsAV1SFRPlaybackPerformancePlaybackPerfAV1.1080p.30fps@1.5X-9.2.18.1] |
ASSUMPTION_FAILURE
|
org.junit.AssumptionViolatedException: Test not enforced
|
| com.google.android.apps.yts.tvts.YtsReport#yts[AV1SFRTestsAV1SFRPlaybackPerformancePlaybackPerfAV1.1080p.30fps@1.75X-9.2.19.1] |
ASSUMPTION_FAILURE
|
org.junit.AssumptionViolatedException: Test not enforced
|
| com.google.android.apps.yts.tvts.YtsReport#yts[AV1SFRTestsAV1SFRPlaybackPerformancePlaybackPerfAV1.1080p.30fps@1X-9.2.16.1] |
ASSUMPTION_FAILURE
|
org.junit.AssumptionViolatedException: Test not enforced
|
| com.google.android.apps.yts.tvts.YtsReport#yts[AV1SFRTestsAV1SFRPlaybackPerformancePlaybackPerfAV1.1080p.30fps@2X-9.2.20.1] |
ASSUMPTION_FAILURE
|
org.junit.AssumptionViolatedException: Test not enforced
|
| com.google.android.apps.yts.tvts.YtsReport#yts[AV1SFRTestsAV1SFRPlaybackPerformancePlaybackPerfAV1.1440p.30fps@0.25X-9.2.21.1] |
ASSUMPTION_FAILURE
|
org.junit.AssumptionViolatedException: Test not enforced
|
| com.google.android.apps.yts.tvts.YtsReport#yts[AV1SFRTestsAV1SFRPlaybackPerformancePlaybackPerfAV1.1440p.30fps@0.5X-9.2.22.1] |
ASSUMPTION_FAILURE
|
org.junit.AssumptionViolatedException: Test not enforced
|
| com.google.android.apps.yts.tvts.YtsReport#yts[AV1SFRTestsAV1SFRPlaybackPerformancePlaybackPerfAV1.1440p.30fps@0.75X-9.2.23.1] |
ASSUMPTION_FAILURE
|
org.junit.AssumptionViolatedException: Test not enforced
|
| com.google.android.apps.yts.tvts.YtsReport#yts[AV1SFRTestsAV1SFRPlaybackPerformancePlaybackPerfAV1.1440p.30fps@1.25X-9.2.25.1] |
ASSUMPTION_FAILURE
|
org.junit.AssumptionViolatedException: Test not enforced
|
| com.google.android.apps.yts.tvts.YtsReport#yts[AV1SFRTestsAV1SFRPlaybackPerformancePlaybackPerfAV1.1440p.30fps@1.5X-9.2.26.1] |
ASSUMPTION_FAILURE
|
org.junit.AssumptionViolatedException: Test not enforced
|
| com.google.android.apps.yts.tvts.YtsReport#yts[AV1SFRTestsAV1SFRPlaybackPerformancePlaybackPerfAV1.1440p.30fps@1.75X-9.2.27.1] |
ASSUMPTION_FAILURE
|
org.junit.AssumptionViolatedException: Test not enforced
|
| com.google.android.apps.yts.tvts.YtsReport#yts[AV1SFRTestsAV1SFRPlaybackPerformancePlaybackPerfAV1.1440p.30fps@1X-9.2.24.1] |
ASSUMPTION_FAILURE
|
org.junit.AssumptionViolatedException: Test not enforced
|
| com.google.android.apps.yts.tvts.YtsReport#yts[AV1SFRTestsAV1SFRPlaybackPerformancePlaybackPerfAV1.1440p.30fps@2X-9.2.28.1] |
ASSUMPTION_FAILURE
|
org.junit.AssumptionViolatedException: Test not enforced
|
| com.google.android.apps.yts.tvts.YtsReport#yts[AV1SFRTestsAV1SFRPlaybackPerformancePlaybackPerfAV1.144p.30fps@1X-9.2.1.1] |
ASSUMPTION_FAILURE
|
org.junit.AssumptionViolatedException: Test not enforced
|
| com.google.android.apps.yts.tvts.YtsReport#yts[AV1SFRTestsAV1SFRPlaybackPerformancePlaybackPerfAV1.2160p.30fps@0.25X-9.2.29.1] |
ASSUMPTION_FAILURE
|
org.junit.AssumptionViolatedException: Test not enforced
|
| com.google.android.apps.yts.tvts.YtsReport#yts[AV1SFRTestsAV1SFRPlaybackPerformancePlaybackPerfAV1.2160p.30fps@0.5X-9.2.30.1] |
ASSUMPTION_FAILURE
|
org.junit.AssumptionViolatedException: Test not enforced
|
| com.google.android.apps.yts.tvts.YtsReport#yts[AV1SFRTestsAV1SFRPlaybackPerformancePlaybackPerfAV1.2160p.30fps@0.75X-9.2.31.1] |
ASSUMPTION_FAILURE
|
org.junit.AssumptionViolatedException: Test not enforced
|
| com.google.android.apps.yts.tvts.YtsReport#yts[AV1SFRTestsAV1SFRPlaybackPerformancePlaybackPerfAV1.2160p.30fps@1.25X-9.2.33.1] |
ASSUMPTION_FAILURE
|
org.junit.AssumptionViolatedException: Test not enforced
|
| com.google.android.apps.yts.tvts.YtsReport#yts[AV1SFRTestsAV1SFRPlaybackPerformancePlaybackPerfAV1.2160p.30fps@1.5X-9.2.34.1] |
ASSUMPTION_FAILURE
|
org.junit.AssumptionViolatedException: Test not enforced
|
| com.google.android.apps.yts.tvts.YtsReport#yts[AV1SFRTestsAV1SFRPlaybackPerformancePlaybackPerfAV1.2160p.30fps@1.75X-9.2.35.1] |
ASSUMPTION_FAILURE
|
org.junit.AssumptionViolatedException: Test not enforced
|
| com.google.android.apps.yts.tvts.YtsReport#yts[AV1SFRTestsAV1SFRPlaybackPerformancePlaybackPerfAV1.2160p.30fps@1X-9.2.32.1] |
ASSUMPTION_FAILURE
|
org.junit.AssumptionViolatedException: Test not enforced
|
| com.google.android.apps.yts.tvts.YtsReport#yts[AV1SFRTestsAV1SFRPlaybackPerformancePlaybackPerfAV1.2160p.30fps@2X-9.2.36.1] |
ASSUMPTION_FAILURE
|
org.junit.AssumptionViolatedException: Test not enforced
|
| com.google.android.apps.yts.tvts.YtsReport#yts[AV1SFRTestsAV1SFRPlaybackPerformancePlaybackPerfAV1.240p.30fps@1X-9.2.2.1] |
ASSUMPTION_FAILURE
|
org.junit.AssumptionViolatedException: Test not enforced
|
| com.google.android.apps.yts.tvts.YtsReport#yts[AV1SFRTestsAV1SFRPlaybackPerformancePlaybackPerfAV1.360p.30fps@1X-9.2.3.1] |
ASSUMPTION_FAILURE
|
org.junit.AssumptionViolatedException: Test not enforced
|
| com.google.android.apps.yts.tvts.YtsReport#yts[AV1SFRTestsAV1SFRPlaybackPerformancePlaybackPerfAV1.480p.30fps@1X-9.2.4.1] |
ASSUMPTION_FAILURE
|
org.junit.AssumptionViolatedException: Test not enforced
|
| com.google.android.apps.yts.tvts.YtsReport#yts[AV1SFRTestsAV1SFRPlaybackPerformancePlaybackPerfAV1.720p.30fps@0.25X-9.2.5.1] |
ASSUMPTION_FAILURE
|
org.junit.AssumptionViolatedException: Test not enforced
|
| com.google.android.apps.yts.tvts.YtsReport#yts[AV1SFRTestsAV1SFRPlaybackPerformancePlaybackPerfAV1.720p.30fps@0.5X-9.2.6.1] |
ASSUMPTION_FAILURE
|
org.junit.AssumptionViolatedException: Test not enforced
|
| com.google.android.apps.yts.tvts.YtsReport#yts[AV1SFRTestsAV1SFRPlaybackPerformancePlaybackPerfAV1.720p.30fps@0.75X-9.2.7.1] |
ASSUMPTION_FAILURE
|
org.junit.AssumptionViolatedException: Test not enforced
|
| com.google.android.apps.yts.tvts.YtsReport#yts[AV1SFRTestsAV1SFRPlaybackPerformancePlaybackPerfAV1.720p.30fps@1.25X-9.2.9.1] |
ASSUMPTION_FAILURE
|
org.junit.AssumptionViolatedException: Test not enforced
|
| com.google.android.apps.yts.tvts.YtsReport#yts[AV1SFRTestsAV1SFRPlaybackPerformancePlaybackPerfAV1.720p.30fps@1.5X-9.2.10.1] |
ASSUMPTION_FAILURE
|
org.junit.AssumptionViolatedException: Test not enforced
|
| com.google.android.apps.yts.tvts.YtsReport#yts[AV1SFRTestsAV1SFRPlaybackPerformancePlaybackPerfAV1.720p.30fps@1.75X-9.2.11.1] |
ASSUMPTION_FAILURE
|
org.junit.AssumptionViolatedException: Test not enforced
|
| com.google.android.apps.yts.tvts.YtsReport#yts[AV1SFRTestsAV1SFRPlaybackPerformancePlaybackPerfAV1.720p.30fps@1X-9.2.8.1] |
ASSUMPTION_FAILURE
|
org.junit.AssumptionViolatedException: Test not enforced
|
| com.google.android.apps.yts.tvts.YtsReport#yts[AV1SFRTestsAV1SFRPlaybackPerformancePlaybackPerfAV1.720p.30fps@2X-9.2.12.1] |
ASSUMPTION_FAILURE
|
org.junit.AssumptionViolatedException: Test not enforced
|
| com.google.android.apps.yts.tvts.YtsReport#yts[AV1SFRTestsMediaPlaybackQualityFrameDrop-9.1.2.1] |
ASSUMPTION_FAILURE
|
org.junit.AssumptionViolatedException: Test not enforced
|
| com.google.android.apps.yts.tvts.YtsReport#yts[AV1SFRTestsMediaPlaybackQualityTotalVideoFrames-9.1.1.1] |
ASSUMPTION_FAILURE
|
org.junit.AssumptionViolatedException: Test not enforced
|
| com.google.android.apps.yts.tvts.YtsReport#yts[CSSConformanceTestsBackgroundbackground-15.2.1.1] |
ASSUMPTION_FAILURE
|
org.junit.AssumptionViolatedException: Test not enforced
|
| com.google.android.apps.yts.tvts.YtsReport#yts[CSSConformanceTestsBackgroundbackground-color-15.2.3.1] |
ASSUMPTION_FAILURE
|
org.junit.AssumptionViolatedException: Test not enforced
|
| com.google.android.apps.yts.tvts.YtsReport#yts[CSSConformanceTestsBackgroundbackground-image-15.2.4.1] |
ASSUMPTION_FAILURE
|
org.junit.AssumptionViolatedException: Test not enforced
|
| com.google.android.apps.yts.tvts.YtsReport#yts[CSSConformanceTestsBackgroundbackground-position-15.2.5.1] |
ASSUMPTION_FAILURE
|
org.junit.AssumptionViolatedException: Test not enforced
|
| com.google.android.apps.yts.tvts.YtsReport#yts[CSSConformanceTestsBackgroundbackground-repeat-15.2.6.1] |
ASSUMPTION_FAILURE
|
org.junit.AssumptionViolatedException: Test not enforced
|
| com.google.android.apps.yts.tvts.YtsReport#yts[CSSConformanceTestsBackgroundbackground-size-15.2.7.1] |
ASSUMPTION_FAILURE
|
org.junit.AssumptionViolatedException: Test not enforced
|
| com.google.android.apps.yts.tvts.YtsReport#yts[CSSConformanceTestsBorderborder-15.3.1.1] |
ASSUMPTION_FAILURE
|
org.junit.AssumptionViolatedException: Test not enforced
|
| com.google.android.apps.yts.tvts.YtsReport#yts[CSSConformanceTestsBorderborder-bottom-15.3.19.1] |
ASSUMPTION_FAILURE
|
org.junit.AssumptionViolatedException: Test not enforced
|
| com.google.android.apps.yts.tvts.YtsReport#yts[CSSConformanceTestsBorderborder-bottom-color-15.3.20.1] |
ASSUMPTION_FAILURE
|
org.junit.AssumptionViolatedException: Test not enforced
|
| com.google.android.apps.yts.tvts.YtsReport#yts[CSSConformanceTestsBorderborder-bottom-style-15.3.21.1] |
ASSUMPTION_FAILURE
|
org.junit.AssumptionViolatedException: Test not enforced
|
| com.google.android.apps.yts.tvts.YtsReport#yts[CSSConformanceTestsBorderborder-bottom-width-15.3.22.1] |
ASSUMPTION_FAILURE
|
org.junit.AssumptionViolatedException: Test not enforced
|
| com.google.android.apps.yts.tvts.YtsReport#yts[CSSConformanceTestsBorderborder-color-15.3.3.1] |
ASSUMPTION_FAILURE
|
org.junit.AssumptionViolatedException: Test not enforced
|
| com.google.android.apps.yts.tvts.YtsReport#yts[CSSConformanceTestsBorderborder-left-15.3.4.1] |
ASSUMPTION_FAILURE
|
org.junit.AssumptionViolatedException: Test not enforced
|
| com.google.android.apps.yts.tvts.YtsReport#yts[CSSConformanceTestsBorderborder-left-color-15.3.5.1] |
ASSUMPTION_FAILURE
|
org.junit.AssumptionViolatedException: Test not enforced
|
| com.google.android.apps.yts.tvts.YtsReport#yts[CSSConformanceTestsBorderborder-left-style-15.3.6.1] |
ASSUMPTION_FAILURE
|
org.junit.AssumptionViolatedException: Test not enforced
|
| com.google.android.apps.yts.tvts.YtsReport#yts[CSSConformanceTestsBorderborder-left-width-15.3.7.1] |
ASSUMPTION_FAILURE
|
org.junit.AssumptionViolatedException: Test not enforced
|
| com.google.android.apps.yts.tvts.YtsReport#yts[CSSConformanceTestsBorderborder-right-15.3.8.1] |
ASSUMPTION_FAILURE
|
org.junit.AssumptionViolatedException: Test not enforced
|
| com.google.android.apps.yts.tvts.YtsReport#yts[CSSConformanceTestsBorderborder-right-color-15.3.9.1] |
ASSUMPTION_FAILURE
|
org.junit.AssumptionViolatedException: Test not enforced
|
| com.google.android.apps.yts.tvts.YtsReport#yts[CSSConformanceTestsBorderborder-right-style-15.3.10.1] |
ASSUMPTION_FAILURE
|
org.junit.AssumptionViolatedException: Test not enforced
|
| com.google.android.apps.yts.tvts.YtsReport#yts[CSSConformanceTestsBorderborder-right-width-15.3.11.1] |
ASSUMPTION_FAILURE
|
org.junit.AssumptionViolatedException: Test not enforced
|
| com.google.android.apps.yts.tvts.YtsReport#yts[CSSConformanceTestsBorderborder-style-15.3.13.1] |
ASSUMPTION_FAILURE
|
org.junit.AssumptionViolatedException: Test not enforced
|
| com.google.android.apps.yts.tvts.YtsReport#yts[CSSConformanceTestsBorderborder-top-15.3.14.1] |
ASSUMPTION_FAILURE
|
org.junit.AssumptionViolatedException: Test not enforced
|
| com.google.android.apps.yts.tvts.YtsReport#yts[CSSConformanceTestsBorderborder-top-color-15.3.15.1] |
ASSUMPTION_FAILURE
|
org.junit.AssumptionViolatedException: Test not enforced
|
| com.google.android.apps.yts.tvts.YtsReport#yts[CSSConformanceTestsBorderborder-top-style-15.3.16.1] |
ASSUMPTION_FAILURE
|
org.junit.AssumptionViolatedException: Test not enforced
|
| com.google.android.apps.yts.tvts.YtsReport#yts[CSSConformanceTestsBorderborder-top-width-15.3.17.1] |
ASSUMPTION_FAILURE
|
org.junit.AssumptionViolatedException: Test not enforced
|
| com.google.android.apps.yts.tvts.YtsReport#yts[CSSConformanceTestsBorderborder-width-15.3.18.1] |
ASSUMPTION_FAILURE
|
org.junit.AssumptionViolatedException: Test not enforced
|
| com.google.android.apps.yts.tvts.YtsReport#yts[CSSConformanceTestsCSSFundamentalsanimation-15.4.1.1] |
ASSUMPTION_FAILURE
|
org.junit.AssumptionViolatedException: Test not enforced
|
| com.google.android.apps.yts.tvts.YtsReport#yts[CSSConformanceTestsCSSFundamentalsbottom-15.4.2.1] |
ASSUMPTION_FAILURE
|
org.junit.AssumptionViolatedException: Test not enforced
|
| com.google.android.apps.yts.tvts.YtsReport#yts[CSSConformanceTestsCSSFundamentalsbox-shadow-15.4.3.1] |
ASSUMPTION_FAILURE
|
org.junit.AssumptionViolatedException: Test not enforced
|
| com.google.android.apps.yts.tvts.YtsReport#yts[CSSConformanceTestsCSSFundamentalscolor-15.4.7.1] |
ASSUMPTION_FAILURE
|
org.junit.AssumptionViolatedException: Test not enforced
|
| com.google.android.apps.yts.tvts.YtsReport#yts[CSSConformanceTestsCSSFundamentalscontent-15.4.8.1] |
ASSUMPTION_FAILURE
|
org.junit.AssumptionViolatedException: Test not enforced
|
| com.google.android.apps.yts.tvts.YtsReport#yts[CSSConformanceTestsCSSFundamentalsdisplay-15.4.14.1] |
ASSUMPTION_FAILURE
|
org.junit.AssumptionViolatedException: Test not enforced
|
| com.google.android.apps.yts.tvts.YtsReport#yts[CSSConformanceTestsCSSFundamentalsheight-15.4.17.1] |
ASSUMPTION_FAILURE
|
org.junit.AssumptionViolatedException: Test not enforced
|
| com.google.android.apps.yts.tvts.YtsReport#yts[CSSConformanceTestsCSSFundamentalsleft-15.4.18.1] |
ASSUMPTION_FAILURE
|
org.junit.AssumptionViolatedException: Test not enforced
|
| com.google.android.apps.yts.tvts.YtsReport#yts[CSSConformanceTestsCSSFundamentalsline-height-15.4.20.1] |
ASSUMPTION_FAILURE
|
org.junit.AssumptionViolatedException: Test not enforced
|
| com.google.android.apps.yts.tvts.YtsReport#yts[CSSConformanceTestsCSSFundamentalsmax-height-15.4.21.1] |
ASSUMPTION_FAILURE
|
org.junit.AssumptionViolatedException: Test not enforced
|
| com.google.android.apps.yts.tvts.YtsReport#yts[CSSConformanceTestsCSSFundamentalsmax-width-15.4.22.1] |
ASSUMPTION_FAILURE
|
org.junit.AssumptionViolatedException: Test not enforced
|
| com.google.android.apps.yts.tvts.YtsReport#yts[CSSConformanceTestsCSSFundamentalsmin-height-15.4.23.1] |
ASSUMPTION_FAILURE
|
org.junit.AssumptionViolatedException: Test not enforced
|
| com.google.android.apps.yts.tvts.YtsReport#yts[CSSConformanceTestsCSSFundamentalsmin-width-15.4.24.1] |
ASSUMPTION_FAILURE
|
org.junit.AssumptionViolatedException: Test not enforced
|
| com.google.android.apps.yts.tvts.YtsReport#yts[CSSConformanceTestsCSSFundamentalsopacity-15.4.25.1] |
ASSUMPTION_FAILURE
|
org.junit.AssumptionViolatedException: Test not enforced
|
| com.google.android.apps.yts.tvts.YtsReport#yts[CSSConformanceTestsCSSFundamentalsoverflow-15.4.27.1] |
ASSUMPTION_FAILURE
|
org.junit.AssumptionViolatedException: Test not enforced
|
| com.google.android.apps.yts.tvts.YtsReport#yts[CSSConformanceTestsCSSFundamentalsposition-15.4.28.1] |
ASSUMPTION_FAILURE
|
org.junit.AssumptionViolatedException: Test not enforced
|
| com.google.android.apps.yts.tvts.YtsReport#yts[CSSConformanceTestsCSSFundamentalsright-15.4.30.1] |
ASSUMPTION_FAILURE
|
org.junit.AssumptionViolatedException: Test not enforced
|
| com.google.android.apps.yts.tvts.YtsReport#yts[CSSConformanceTestsCSSFundamentalstop-15.4.33.1] |
ASSUMPTION_FAILURE
|
org.junit.AssumptionViolatedException: Test not enforced
|
| com.google.android.apps.yts.tvts.YtsReport#yts[CSSConformanceTestsCSSFundamentalstransform-15.4.34.1] |
ASSUMPTION_FAILURE
|
org.junit.AssumptionViolatedException: Test not enforced
|
| com.google.android.apps.yts.tvts.YtsReport#yts[CSSConformanceTestsCSSFundamentalstransform-origin-15.4.35.1] |
ASSUMPTION_FAILURE
|
org.junit.AssumptionViolatedException: Test not enforced
|
| com.google.android.apps.yts.tvts.YtsReport#yts[CSSConformanceTestsCSSFundamentalsvertical-align-15.4.37.1] |
ASSUMPTION_FAILURE
|
org.junit.AssumptionViolatedException: Test not enforced
|
| com.google.android.apps.yts.tvts.YtsReport#yts[CSSConformanceTestsCSSFundamentalsvisibility-15.4.38.1] |
ASSUMPTION_FAILURE
|
org.junit.AssumptionViolatedException: Test not enforced
|
| com.google.android.apps.yts.tvts.YtsReport#yts[CSSConformanceTestsCSSFundamentalswhite-space-15.4.39.1] |
ASSUMPTION_FAILURE
|
org.junit.AssumptionViolatedException: Test not enforced
|
| com.google.android.apps.yts.tvts.YtsReport#yts[CSSConformanceTestsCSSFundamentalswidth-15.4.41.1] |
ASSUMPTION_FAILURE
|
org.junit.AssumptionViolatedException: Test not enforced
|
| com.google.android.apps.yts.tvts.YtsReport#yts[CSSConformanceTestsCSSFundamentalsz-index-15.4.43.1] |
ASSUMPTION_FAILURE
|
org.junit.AssumptionViolatedException: Test not enforced
|
| com.google.android.apps.yts.tvts.YtsReport#yts[CSSConformanceTestsFontfont-15.5.1.1] |
ASSUMPTION_FAILURE
|
org.junit.AssumptionViolatedException: Test not enforced
|
| com.google.android.apps.yts.tvts.YtsReport#yts[CSSConformanceTestsFontfont-family-15.5.2.1] |
ASSUMPTION_FAILURE
|
org.junit.AssumptionViolatedException: Test not enforced
|
| com.google.android.apps.yts.tvts.YtsReport#yts[CSSConformanceTestsFontfont-size-15.5.3.1] |
ASSUMPTION_FAILURE
|
org.junit.AssumptionViolatedException: Test not enforced
|
| com.google.android.apps.yts.tvts.YtsReport#yts[CSSConformanceTestsFontfont-style-15.5.5.1] |
ASSUMPTION_FAILURE
|
org.junit.AssumptionViolatedException: Test not enforced
|
| com.google.android.apps.yts.tvts.YtsReport#yts[CSSConformanceTestsFontfont-weight-15.5.7.1] |
ASSUMPTION_FAILURE
|
org.junit.AssumptionViolatedException: Test not enforced
|
| com.google.android.apps.yts.tvts.YtsReport#yts[CSSConformanceTestsMarginmargin-15.7.1.1] |
ASSUMPTION_FAILURE
|
org.junit.AssumptionViolatedException: Test not enforced
|
| com.google.android.apps.yts.tvts.YtsReport#yts[CSSConformanceTestsMarginmargin-bottom-15.7.5.1] |
ASSUMPTION_FAILURE
|
org.junit.AssumptionViolatedException: Test not enforced
|
| com.google.android.apps.yts.tvts.YtsReport#yts[CSSConformanceTestsMarginmargin-left-15.7.2.1] |
ASSUMPTION_FAILURE
|
org.junit.AssumptionViolatedException: Test not enforced
|
| com.google.android.apps.yts.tvts.YtsReport#yts[CSSConformanceTestsMarginmargin-right-15.7.3.1] |
ASSUMPTION_FAILURE
|
org.junit.AssumptionViolatedException: Test not enforced
|
| com.google.android.apps.yts.tvts.YtsReport#yts[CSSConformanceTestsMarginmargin-top-15.7.4.1] |
ASSUMPTION_FAILURE
|
org.junit.AssumptionViolatedException: Test not enforced
|
| com.google.android.apps.yts.tvts.YtsReport#yts[CSSConformanceTestsOutlineoutline-15.8.1.1] |
ASSUMPTION_FAILURE
|
org.junit.AssumptionViolatedException: Test not enforced
|
| com.google.android.apps.yts.tvts.YtsReport#yts[CSSConformanceTestsOutlineoutline-color-15.8.2.1] |
ASSUMPTION_FAILURE
|
org.junit.AssumptionViolatedException: Test not enforced
|
| com.google.android.apps.yts.tvts.YtsReport#yts[CSSConformanceTestsOutlineoutline-style-15.8.3.1] |
ASSUMPTION_FAILURE
|
org.junit.AssumptionViolatedException: Test not enforced
|
| com.google.android.apps.yts.tvts.YtsReport#yts[CSSConformanceTestsOutlineoutline-width-15.8.4.1] |
ASSUMPTION_FAILURE
|
org.junit.AssumptionViolatedException: Test not enforced
|
| com.google.android.apps.yts.tvts.YtsReport#yts[CSSConformanceTestsPaddingpadding-15.9.1.1] |
ASSUMPTION_FAILURE
|
org.junit.AssumptionViolatedException: Test not enforced
|
| com.google.android.apps.yts.tvts.YtsReport#yts[CSSConformanceTestsPaddingpadding-bottom-15.9.5.1] |
ASSUMPTION_FAILURE
|
org.junit.AssumptionViolatedException: Test not enforced
|
| com.google.android.apps.yts.tvts.YtsReport#yts[CSSConformanceTestsPaddingpadding-left-15.9.2.1] |
ASSUMPTION_FAILURE
|
org.junit.AssumptionViolatedException: Test not enforced
|
| com.google.android.apps.yts.tvts.YtsReport#yts[CSSConformanceTestsPaddingpadding-right-15.9.3.1] |
ASSUMPTION_FAILURE
|
org.junit.AssumptionViolatedException: Test not enforced
|
| com.google.android.apps.yts.tvts.YtsReport#yts[CSSConformanceTestsPaddingpadding-top-15.9.4.1] |
ASSUMPTION_FAILURE
|
org.junit.AssumptionViolatedException: Test not enforced
|
| com.google.android.apps.yts.tvts.YtsReport#yts[CSSConformanceTestsSelectorAttributeselector-15.13.7.1] |
ASSUMPTION_FAILURE
|
org.junit.AssumptionViolatedException: Test not enforced
|
| com.google.android.apps.yts.tvts.YtsReport#yts[CSSConformanceTestsSelectorChildselector-15.13.6.1] |
ASSUMPTION_FAILURE
|
org.junit.AssumptionViolatedException: Test not enforced
|
| com.google.android.apps.yts.tvts.YtsReport#yts[CSSConformanceTestsSelectorClassselector-15.13.3.1] |
ASSUMPTION_FAILURE
|
org.junit.AssumptionViolatedException: Test not enforced
|
| com.google.android.apps.yts.tvts.YtsReport#yts[CSSConformanceTestsSelectorDescendantselector-15.13.5.1] |
ASSUMPTION_FAILURE
|
org.junit.AssumptionViolatedException: Test not enforced
|
| com.google.android.apps.yts.tvts.YtsReport#yts[CSSConformanceTestsSelectorIDselector-15.13.2.1] |
ASSUMPTION_FAILURE
|
org.junit.AssumptionViolatedException: Test not enforced
|
| com.google.android.apps.yts.tvts.YtsReport#yts[CSSConformanceTestsSelectorMultipleClassselector-15.13.4.1] |
ASSUMPTION_FAILURE
|
org.junit.AssumptionViolatedException: Test not enforced
|
| com.google.android.apps.yts.tvts.YtsReport#yts[CSSConformanceTestsSelectorTypeselector-15.13.1.1] |
ASSUMPTION_FAILURE
|
org.junit.AssumptionViolatedException: Test not enforced
|
| com.google.android.apps.yts.tvts.YtsReport#yts[CSSConformanceTestsTexttext-align-15.11.1.1] |
ASSUMPTION_FAILURE
|
org.junit.AssumptionViolatedException: Test not enforced
|
| com.google.android.apps.yts.tvts.YtsReport#yts[CSSConformanceTestsTexttext-decoration-15.11.2.1] |
ASSUMPTION_FAILURE
|
org.junit.AssumptionViolatedException: Test not enforced
|
| com.google.android.apps.yts.tvts.YtsReport#yts[CSSConformanceTestsTexttext-indent-15.11.3.1] |
ASSUMPTION_FAILURE
|
org.junit.AssumptionViolatedException: Test not enforced
|
| com.google.android.apps.yts.tvts.YtsReport#yts[CSSConformanceTestsTexttext-overflow-15.11.4.1] |
ASSUMPTION_FAILURE
|
org.junit.AssumptionViolatedException: Test not enforced
|
| com.google.android.apps.yts.tvts.YtsReport#yts[CSSConformanceTestsTexttext-shadow-15.11.5.1] |
ASSUMPTION_FAILURE
|
org.junit.AssumptionViolatedException: Test not enforced
|
| com.google.android.apps.yts.tvts.YtsReport#yts[CSSConformanceTestsTexttext-transform-15.11.6.1] |
ASSUMPTION_FAILURE
|
org.junit.AssumptionViolatedException: Test not enforced
|
| com.google.android.apps.yts.tvts.YtsReport#yts[CSSConformanceTestsTrasitiontransition-15.12.1.1] |
ASSUMPTION_FAILURE
|
org.junit.AssumptionViolatedException: Test not enforced
|
| com.google.android.apps.yts.tvts.YtsReport#yts[CSSConformanceTestsTrasitiontransition-delay-15.12.2.1] |
ASSUMPTION_FAILURE
|
org.junit.AssumptionViolatedException: Test not enforced
|
| com.google.android.apps.yts.tvts.YtsReport#yts[CSSConformanceTestsTrasitiontransition-duration-15.12.3.1] |
ASSUMPTION_FAILURE
|
org.junit.AssumptionViolatedException: Test not enforced
|
| com.google.android.apps.yts.tvts.YtsReport#yts[CSSConformanceTestsTrasitiontransition-property-15.12.4.1] |
ASSUMPTION_FAILURE
|
org.junit.AssumptionViolatedException: Test not enforced
|
| com.google.android.apps.yts.tvts.YtsReport#yts[CSSConformanceTestsTrasitiontransition-timing-function-15.12.5.1] |
ASSUMPTION_FAILURE
|
org.junit.AssumptionViolatedException: Test not enforced
|
| com.google.android.apps.yts.tvts.YtsReport#yts[DOMCSSTestsCSSMediaRuleCSSMediaRule.cssRules-17.3.1.1] |
ASSUMPTION_FAILURE
|
org.junit.AssumptionViolatedException: Test not enforced
|
| com.google.android.apps.yts.tvts.YtsReport#yts[DOMCSSTestsCSSMediaRuleCSSMediaRule.insertRule-17.3.3.1] |
ASSUMPTION_FAILURE
|
org.junit.AssumptionViolatedException: Test not enforced
|
| com.google.android.apps.yts.tvts.YtsReport#yts[DOMCSSTestsCSSMediaRuleCSSMediaRule.media-17.3.4.1] |
ASSUMPTION_FAILURE
|
org.junit.AssumptionViolatedException: Test not enforced
|
| com.google.android.apps.yts.tvts.YtsReport#yts[DOMCSSTestsCSSRuleCSSRule.cssText-17.5.1.1] |
ASSUMPTION_FAILURE
|
org.junit.AssumptionViolatedException: Test not enforced
|
| com.google.android.apps.yts.tvts.YtsReport#yts[DOMCSSTestsCSSRuleCSSRule.parentRule-17.5.2.1] |
ASSUMPTION_FAILURE
|
org.junit.AssumptionViolatedException: Test not enforced
|
| com.google.android.apps.yts.tvts.YtsReport#yts[DOMCSSTestsCSSRuleCSSRule.parentStyleSheet-17.5.3.1] |
ASSUMPTION_FAILURE
|
org.junit.AssumptionViolatedException: Test not enforced
|
| com.google.android.apps.yts.tvts.YtsReport#yts[DOMCSSTestsCSSRuleListCSSRuleList.item-17.6.1.1] |
ASSUMPTION_FAILURE
|
org.junit.AssumptionViolatedException: Test not enforced
|
| com.google.android.apps.yts.tvts.YtsReport#yts[DOMCSSTestsCSSRuleListCSSRuleList.length-17.6.2.1] |
ASSUMPTION_FAILURE
|
org.junit.AssumptionViolatedException: Test not enforced
|
| com.google.android.apps.yts.tvts.YtsReport#yts[DOMCSSTestsCSSStyleDeclarationCSSStyleDeclaration.cssText-17.7.1.1] |
ASSUMPTION_FAILURE
|
org.junit.AssumptionViolatedException: Test not enforced
|
| com.google.android.apps.yts.tvts.YtsReport#yts[DOMCSSTestsCSSStyleDeclarationCSSStyleDeclaration.getPropertyValue-17.7.4.1] |
ASSUMPTION_FAILURE
|
org.junit.AssumptionViolatedException: Test not enforced
|
| com.google.android.apps.yts.tvts.YtsReport#yts[DOMCSSTestsCSSStyleDeclarationCSSStyleDeclaration.item-17.7.5.1] |
ASSUMPTION_FAILURE
|
org.junit.AssumptionViolatedException: Test not enforced
|
| com.google.android.apps.yts.tvts.YtsReport#yts[DOMCSSTestsCSSStyleDeclarationCSSStyleDeclaration.length-17.7.6.1] |
ASSUMPTION_FAILURE
|
org.junit.AssumptionViolatedException: Test not enforced
|
| com.google.android.apps.yts.tvts.YtsReport#yts[DOMCSSTestsCSSStyleDeclarationCSSStyleDeclaration.parentRule-17.7.7.1] |
ASSUMPTION_FAILURE
|
org.junit.AssumptionViolatedException: Test not enforced
|
| com.google.android.apps.yts.tvts.YtsReport#yts[DOMCSSTestsCSSStyleDeclarationCSSStyleDeclaration.removeProperty-17.7.8.1] |
ASSUMPTION_FAILURE
|
org.junit.AssumptionViolatedException: Test not enforced
|
| com.google.android.apps.yts.tvts.YtsReport#yts[DOMCSSTestsCSSStyleDeclarationCSSStyleDeclaration.setProperty-17.7.9.1] |
ASSUMPTION_FAILURE
|
org.junit.AssumptionViolatedException: Test not enforced
|
| com.google.android.apps.yts.tvts.YtsReport#yts[DOMCSSTestsCSSStyleRuleCSSStyleRule.style-17.8.2.1] |
ASSUMPTION_FAILURE
|
org.junit.AssumptionViolatedException: Test not enforced
|
| com.google.android.apps.yts.tvts.YtsReport#yts[DOMCSSTestsCSSStyleSheetCSSStyleSheet.cssRules-17.9.1.1] |
ASSUMPTION_FAILURE
|
org.junit.AssumptionViolatedException: Test not enforced
|
| com.google.android.apps.yts.tvts.YtsReport#yts[DOMCSSTestsCSSStyleSheetCSSStyleSheet.insertRule-17.9.3.1] |
ASSUMPTION_FAILURE
|
org.junit.AssumptionViolatedException: Test not enforced
|
| com.google.android.apps.yts.tvts.YtsReport#yts[DOMDocumentTestsDOMImplementationDOMImplementation.createDocument-18.1.1.1] |
ASSUMPTION_FAILURE
|
org.junit.AssumptionViolatedException: Test not enforced
|
| com.google.android.apps.yts.tvts.YtsReport#yts[DOMDocumentTestsDocumentDocument.createComment-18.2.4.1] |
ASSUMPTION_FAILURE
|
org.junit.AssumptionViolatedException: Test not enforced
|
| com.google.android.apps.yts.tvts.YtsReport#yts[DOMDocumentTestsDocumentDocument.createElement-18.2.6.1] |
ASSUMPTION_FAILURE
|
org.junit.AssumptionViolatedException: Test not enforced
|
| com.google.android.apps.yts.tvts.YtsReport#yts[DOMDocumentTestsDocumentDocument.createElementNS-18.2.7.1] |
ASSUMPTION_FAILURE
|
org.junit.AssumptionViolatedException: Test not enforced
|
| com.google.android.apps.yts.tvts.YtsReport#yts[DOMDocumentTestsDocumentDocument.createEvent-18.2.17.1] |
ASSUMPTION_FAILURE
|
org.junit.AssumptionViolatedException: Test not enforced
|
| com.google.android.apps.yts.tvts.YtsReport#yts[DOMDocumentTestsDocumentDocument.createTextNode-18.2.9.1] |
ASSUMPTION_FAILURE
|
org.junit.AssumptionViolatedException: Test not enforced
|
| com.google.android.apps.yts.tvts.YtsReport#yts[DOMDocumentTestsDocumentDocument.documentElement-18.2.11.1] |
ASSUMPTION_FAILURE
|
org.junit.AssumptionViolatedException: Test not enforced
|
| com.google.android.apps.yts.tvts.YtsReport#yts[DOMDocumentTestsDocumentDocument.getElementById-18.2.12.1] |
ASSUMPTION_FAILURE
|
org.junit.AssumptionViolatedException: Test not enforced
|
| com.google.android.apps.yts.tvts.YtsReport#yts[DOMDocumentTestsDocumentDocument.getElementsByTagName-18.2.13.1] |
ASSUMPTION_FAILURE
|
org.junit.AssumptionViolatedException: Test not enforced
|
| com.google.android.apps.yts.tvts.YtsReport#yts[DOMDocumentTestsDocumentDocument.implementation-18.2.15.1] |
ASSUMPTION_FAILURE
|
org.junit.AssumptionViolatedException: Test not enforced
|
| com.google.android.apps.yts.tvts.YtsReport#yts[DOMDocumentTestsDocumentDocument.styleSheets-18.2.18.1] |
ASSUMPTION_FAILURE
|
org.junit.AssumptionViolatedException: Test not enforced
|
| com.google.android.apps.yts.tvts.YtsReport#yts[DOMDocumentTestsElementElement.getAttribute-18.4.1.1] |
ASSUMPTION_FAILURE
|
org.junit.AssumptionViolatedException: Test not enforced
|
| com.google.android.apps.yts.tvts.YtsReport#yts[DOMDocumentTestsElementElement.getAttributeNS-18.4.2.1] |
ASSUMPTION_FAILURE
|
org.junit.AssumptionViolatedException: Test not enforced
|
| com.google.android.apps.yts.tvts.YtsReport#yts[DOMDocumentTestsElementElement.getElementsByTagName-18.4.5.1] |
ASSUMPTION_FAILURE
|
org.junit.AssumptionViolatedException: Test not enforced
|
| com.google.android.apps.yts.tvts.YtsReport#yts[DOMDocumentTestsElementElement.hasAttribute-18.4.7.1] |
ASSUMPTION_FAILURE
|
org.junit.AssumptionViolatedException: Test not enforced
|
| com.google.android.apps.yts.tvts.YtsReport#yts[DOMDocumentTestsElementElement.hasAttributeNS-18.4.8.1] |
ASSUMPTION_FAILURE
|
org.junit.AssumptionViolatedException: Test not enforced
|
| com.google.android.apps.yts.tvts.YtsReport#yts[DOMDocumentTestsElementElement.removeAttribute-18.4.9.1] |
ASSUMPTION_FAILURE
|
org.junit.AssumptionViolatedException: Test not enforced
|
| com.google.android.apps.yts.tvts.YtsReport#yts[DOMDocumentTestsElementElement.setAttribute-18.4.12.1] |
ASSUMPTION_FAILURE
|
org.junit.AssumptionViolatedException: Test not enforced
|
| com.google.android.apps.yts.tvts.YtsReport#yts[DOMDocumentTestsElementElement.style-18.4.17.1] |
ASSUMPTION_FAILURE
|
org.junit.AssumptionViolatedException: Test not enforced
|
| com.google.android.apps.yts.tvts.YtsReport#yts[DOMDocumentTestsElementElement.tagName-18.4.16.1] |
ASSUMPTION_FAILURE
|
org.junit.AssumptionViolatedException: Test not enforced
|
| com.google.android.apps.yts.tvts.YtsReport#yts[DOMDocumentTestsEventEvent.error-18.5.16.1] |
ASSUMPTION_FAILURE
|
org.junit.AssumptionViolatedException: Test not enforced
|
| com.google.android.apps.yts.tvts.YtsReport#yts[DOMDocumentTestsEventEvent.initEvent-18.5.19.1] |
ASSUMPTION_FAILURE
|
org.junit.AssumptionViolatedException: Test not enforced
|
| com.google.android.apps.yts.tvts.YtsReport#yts[DOMDocumentTestsEventEvent.loadeddata-18.5.3.1] |
ASSUMPTION_FAILURE
|
org.junit.AssumptionViolatedException: Test not enforced
|
| com.google.android.apps.yts.tvts.YtsReport#yts[DOMDocumentTestsEventEvent.loadedmetadata-18.5.4.1] |
ASSUMPTION_FAILURE
|
org.junit.AssumptionViolatedException: Test not enforced
|
| com.google.android.apps.yts.tvts.YtsReport#yts[DOMDocumentTestsEventEvent.loadstart-18.5.5.1] |
ASSUMPTION_FAILURE
|
org.junit.AssumptionViolatedException: Test not enforced
|
| com.google.android.apps.yts.tvts.YtsReport#yts[DOMDocumentTestsEventEvent.pause-18.5.6.1] |
ASSUMPTION_FAILURE
|
org.junit.AssumptionViolatedException: Test not enforced
|
| com.google.android.apps.yts.tvts.YtsReport#yts[DOMDocumentTestsEventEvent.play-18.5.7.1] |
ASSUMPTION_FAILURE
|
org.junit.AssumptionViolatedException: Test not enforced
|
| com.google.android.apps.yts.tvts.YtsReport#yts[DOMDocumentTestsEventEvent.playing-18.5.8.1] |
ASSUMPTION_FAILURE
|
org.junit.AssumptionViolatedException: Test not enforced
|
| com.google.android.apps.yts.tvts.YtsReport#yts[DOMDocumentTestsEventEvent.preventDefault-18.5.17.1] |
ASSUMPTION_FAILURE
|
org.junit.AssumptionViolatedException: Test not enforced
|
| com.google.android.apps.yts.tvts.YtsReport#yts[DOMDocumentTestsEventEvent.progress-18.5.9.1] |
ASSUMPTION_FAILURE
|
org.junit.AssumptionViolatedException: Test not enforced
|
| com.google.android.apps.yts.tvts.YtsReport#yts[DOMDocumentTestsEventEvent.seeked-18.5.10.1] |
ASSUMPTION_FAILURE
|
org.junit.AssumptionViolatedException: Test not enforced
|
| com.google.android.apps.yts.tvts.YtsReport#yts[DOMDocumentTestsEventEvent.seeking-18.5.11.1] |
ASSUMPTION_FAILURE
|
org.junit.AssumptionViolatedException: Test not enforced
|
| com.google.android.apps.yts.tvts.YtsReport#yts[DOMDocumentTestsEventEvent.stopPropagation-18.5.18.1] |
ASSUMPTION_FAILURE
|
org.junit.AssumptionViolatedException: Test not enforced
|
| com.google.android.apps.yts.tvts.YtsReport#yts[DOMDocumentTestsEventEvent.timeupdate-18.5.14.1] |
ASSUMPTION_FAILURE
|
org.junit.AssumptionViolatedException: Test not enforced
|
| com.google.android.apps.yts.tvts.YtsReport#yts[DOMDocumentTestsEventEvent.waiting-18.5.15.1] |
ASSUMPTION_FAILURE
|
org.junit.AssumptionViolatedException: Test not enforced
|
| com.google.android.apps.yts.tvts.YtsReport#yts[DOMDocumentTestsEventTargetEventTarget.addEventListener-18.6.1.1] |
ASSUMPTION_FAILURE
|
org.junit.AssumptionViolatedException: Test not enforced
|
| com.google.android.apps.yts.tvts.YtsReport#yts[DOMDocumentTestsEventTargetEventTarget.dispatchEvent-18.6.2.1] |
ASSUMPTION_FAILURE
|
org.junit.AssumptionViolatedException: Test not enforced
|
| com.google.android.apps.yts.tvts.YtsReport#yts[DOMDocumentTestsEventTargetEventTarget.removeEventListener-18.6.3.1] |
ASSUMPTION_FAILURE
|
org.junit.AssumptionViolatedException: Test not enforced
|
| com.google.android.apps.yts.tvts.YtsReport#yts[DOMDocumentTestsHTMLDocumentHTMLDocument.blur-18.8.3.1] |
ASSUMPTION_FAILURE
|
org.junit.AssumptionViolatedException: Test not enforced
|
| com.google.android.apps.yts.tvts.YtsReport#yts[DOMDocumentTestsHTMLDocumentHTMLDocument.body-18.8.1.1] |
ASSUMPTION_FAILURE
|
org.junit.AssumptionViolatedException: Test not enforced
|
| com.google.android.apps.yts.tvts.YtsReport#yts[DOMDocumentTestsHTMLDocumentHTMLDocument.cookie-18.8.2.1] |
ASSUMPTION_FAILURE
|
org.junit.AssumptionViolatedException: Test not enforced
|
| com.google.android.apps.yts.tvts.YtsReport#yts[DOMDocumentTestsHTMLDocumentHTMLDocument.focus-18.8.4.1] |
ASSUMPTION_FAILURE
|
org.junit.AssumptionViolatedException: Test not enforced
|
| com.google.android.apps.yts.tvts.YtsReport#yts[DOMDocumentTestsHTMLDocumentHTMLDocument.load-18.8.5.1] |
ASSUMPTION_FAILURE
|
org.junit.AssumptionViolatedException: Test not enforced
|
| com.google.android.apps.yts.tvts.YtsReport#yts[DOMDocumentTestsHTMLDocumentHTMLDocument.resize-18.8.6.1] |
ASSUMPTION_FAILURE
|
org.junit.AssumptionViolatedException: Test not enforced
|
| com.google.android.apps.yts.tvts.YtsReport#yts[DOMDocumentTestsHTMLElementHTMLElement.className-18.9.1.1] |
ASSUMPTION_FAILURE
|
org.junit.AssumptionViolatedException: Test not enforced
|
| com.google.android.apps.yts.tvts.YtsReport#yts[DOMDocumentTestsHTMLElementHTMLElement.getBoundingClientRect-18.9.2.1] |
ASSUMPTION_FAILURE
|
org.junit.AssumptionViolatedException: Test not enforced
|
| com.google.android.apps.yts.tvts.YtsReport#yts[DOMDocumentTestsHTMLElementHTMLElement.id-18.9.3.1] |
ASSUMPTION_FAILURE
|
org.junit.AssumptionViolatedException: Test not enforced
|
| com.google.android.apps.yts.tvts.YtsReport#yts[DOMDocumentTestsHTMLElementHTMLElement.innerHTML-18.9.4.1] |
ASSUMPTION_FAILURE
|
org.junit.AssumptionViolatedException: Test not enforced
|
| com.google.android.apps.yts.tvts.YtsReport#yts[DOMDocumentTestsHTMLElementHTMLElement.nodeName-18.9.5.1] |
ASSUMPTION_FAILURE
|
org.junit.AssumptionViolatedException: Test not enforced
|
| com.google.android.apps.yts.tvts.YtsReport#yts[DOMDocumentTestsHTMLElementHTMLElement.nodeType-18.9.6.1] |
ASSUMPTION_FAILURE
|
org.junit.AssumptionViolatedException: Test not enforced
|
| com.google.android.apps.yts.tvts.YtsReport#yts[DOMDocumentTestsHTMLElementHTMLElement.style-18.9.7.1] |
ASSUMPTION_FAILURE
|
org.junit.AssumptionViolatedException: Test not enforced
|
| com.google.android.apps.yts.tvts.YtsReport#yts[DOMDocumentTestsHTMLElementHTMLElement.textContent-18.9.8.1] |
ASSUMPTION_FAILURE
|
org.junit.AssumptionViolatedException: Test not enforced
|
| com.google.android.apps.yts.tvts.YtsReport#yts[DOMDocumentTestsHTMLInputElementHTMLInputElement.focus-18.11.1.1] |
ASSUMPTION_FAILURE
|
org.junit.AssumptionViolatedException: Test not enforced
|
| com.google.android.apps.yts.tvts.YtsReport#yts[DOMDocumentTestsHTMLMediaElementHTMLMediaElement.autoplay-18.12.2.1] |
ASSUMPTION_FAILURE
|
org.junit.AssumptionViolatedException: Test not enforced
|
| com.google.android.apps.yts.tvts.YtsReport#yts[DOMDocumentTestsHTMLMediaElementHTMLMediaElement.buffered-18.12.10.1] |
ASSUMPTION_FAILURE
|
org.junit.AssumptionViolatedException: Test not enforced
|
| com.google.android.apps.yts.tvts.YtsReport#yts[DOMDocumentTestsHTMLMediaElementHTMLMediaElement.canPlayType-18.12.1.1] |
ASSUMPTION_FAILURE
|
org.junit.AssumptionViolatedException: Test not enforced
|
| com.google.android.apps.yts.tvts.YtsReport#yts[DOMDocumentTestsHTMLMediaElementHTMLMediaElement.currentTime-18.12.8.1] |
ASSUMPTION_FAILURE
|
org.junit.AssumptionViolatedException: Test not enforced
|
| com.google.android.apps.yts.tvts.YtsReport#yts[DOMDocumentTestsHTMLMediaElementHTMLMediaElement.duration-18.12.9.1] |
ASSUMPTION_FAILURE
|
org.junit.AssumptionViolatedException: Test not enforced
|
| com.google.android.apps.yts.tvts.YtsReport#yts[DOMDocumentTestsHTMLMediaElementHTMLMediaElement.ended-18.12.12.1] |
ASSUMPTION_FAILURE
|
org.junit.AssumptionViolatedException: Test not enforced
|
| com.google.android.apps.yts.tvts.YtsReport#yts[DOMDocumentTestsHTMLMediaElementHTMLMediaElement.load-18.12.3.1] |
ASSUMPTION_FAILURE
|
org.junit.AssumptionViolatedException: Test not enforced
|
| com.google.android.apps.yts.tvts.YtsReport#yts[DOMDocumentTestsHTMLMediaElementHTMLMediaElement.muted-18.12.6.1] |
ASSUMPTION_FAILURE
|
org.junit.AssumptionViolatedException: Test not enforced
|
| com.google.android.apps.yts.tvts.YtsReport#yts[DOMDocumentTestsHTMLMediaElementHTMLMediaElement.pause-18.12.4.1] |
ASSUMPTION_FAILURE
|
org.junit.AssumptionViolatedException: Test not enforced
|
| com.google.android.apps.yts.tvts.YtsReport#yts[DOMDocumentTestsHTMLMediaElementHTMLMediaElement.paused-18.12.11.1] |
ASSUMPTION_FAILURE
|
org.junit.AssumptionViolatedException: Test not enforced
|
| com.google.android.apps.yts.tvts.YtsReport#yts[DOMDocumentTestsHTMLMediaElementHTMLMediaElement.play-18.12.5.1] |
ASSUMPTION_FAILURE
|
org.junit.AssumptionViolatedException: Test not enforced
|
| com.google.android.apps.yts.tvts.YtsReport#yts[DOMDocumentTestsHTMLMediaElementHTMLMediaElement.volume-18.12.7.1] |
ASSUMPTION_FAILURE
|
org.junit.AssumptionViolatedException: Test not enforced
|
| com.google.android.apps.yts.tvts.YtsReport#yts[DOMDocumentTestsHTMLSelectElementHTMLSelectElement.focus-18.13.1.1] |
ASSUMPTION_FAILURE
|
org.junit.AssumptionViolatedException: Test not enforced
|
| com.google.android.apps.yts.tvts.YtsReport#yts[DOMDocumentTestsHTMLAnchorElementHTMLAnchorElement.focus-18.7.1.1] |
ASSUMPTION_FAILURE
|
org.junit.AssumptionViolatedException: Test not enforced
|
| com.google.android.apps.yts.tvts.YtsReport#yts[DOMchardata,window&MiscellaneousTestsAssortedNodeList.length-19.7.2.1] |
ASSUMPTION_FAILURE
|
org.junit.AssumptionViolatedException: Test not enforced
|
| com.google.android.apps.yts.tvts.YtsReport#yts[DOMchardata,window&MiscellaneousTestsAssortedProcessingInstruction.data-19.7.5.1] |
ASSUMPTION_FAILURE
|
org.junit.AssumptionViolatedException: Test not enforced
|
| com.google.android.apps.yts.tvts.YtsReport#yts[DOMchardata,window&MiscellaneousTestsAssortedViewCSS.getComputedStyle-19.7.9.1] |
ASSUMPTION_FAILURE
|
org.junit.AssumptionViolatedException: Test not enforced
|
| com.google.android.apps.yts.tvts.YtsReport#yts[DOMchardata,window&MiscellaneousTestsCharacterDataCharacterData.data-19.1.2.1] |
ASSUMPTION_FAILURE
|
org.junit.AssumptionViolatedException: Test not enforced
|
| com.google.android.apps.yts.tvts.YtsReport#yts[DOMchardata,window&MiscellaneousTestsCreateEventMouseEvents.initMouseEvent-19.8.2.1] |
ASSUMPTION_FAILURE
|
org.junit.AssumptionViolatedException: Test not enforced
|
| com.google.android.apps.yts.tvts.YtsReport#yts[DOMchardata,window&MiscellaneousTestsCreateEventUIEvents.initUIEvent-19.8.1.1] |
ASSUMPTION_FAILURE
|
org.junit.AssumptionViolatedException: Test not enforced
|
| com.google.android.apps.yts.tvts.YtsReport#yts[DOMchardata,window&MiscellaneousTestsHeaptotalJSHeapSize-19.6.1.1] |
ASSUMPTION_FAILURE
|
org.junit.AssumptionViolatedException: Test not enforced
|
| com.google.android.apps.yts.tvts.YtsReport#yts[DOMchardata,window&MiscellaneousTestsHeapusedJSHeapSize-19.6.2.1] |
ASSUMPTION_FAILURE
|
org.junit.AssumptionViolatedException: Test not enforced
|
| com.google.android.apps.yts.tvts.YtsReport#yts[DOMchardata,window&MiscellaneousTestsNamedNodeMapNamedNodeMap.getNamedItem-19.2.1.1] |
ASSUMPTION_FAILURE
|
org.junit.AssumptionViolatedException: Test not enforced
|
| com.google.android.apps.yts.tvts.YtsReport#yts[DOMchardata,window&MiscellaneousTestsNamedNodeMapNamedNodeMap.item-19.2.3.1] |
ASSUMPTION_FAILURE
|
org.junit.AssumptionViolatedException: Test not enforced
|
| com.google.android.apps.yts.tvts.YtsReport#yts[DOMchardata,window&MiscellaneousTestsNamedNodeMapNamedNodeMap.length-19.2.4.1] |
ASSUMPTION_FAILURE
|
org.junit.AssumptionViolatedException: Test not enforced
|
| com.google.android.apps.yts.tvts.YtsReport#yts[DOMchardata,window&MiscellaneousTestsNamedNodeMapNamedNodeMap.removeNamedItem-19.2.5.1] |
ASSUMPTION_FAILURE
|
org.junit.AssumptionViolatedException: Test not enforced
|
| com.google.android.apps.yts.tvts.YtsReport#yts[DOMchardata,window&MiscellaneousTestsNamedNodeMapNamedNodeMap.setNamedItem-19.2.7.1] |
ASSUMPTION_FAILURE
|
org.junit.AssumptionViolatedException: Test not enforced
|
| com.google.android.apps.yts.tvts.YtsReport#yts[DOMchardata,window&MiscellaneousTestsNodeNode.appendChild-19.3.1.1] |
ASSUMPTION_FAILURE
|
org.junit.AssumptionViolatedException: Test not enforced
|
| com.google.android.apps.yts.tvts.YtsReport#yts[DOMchardata,window&MiscellaneousTestsNodeNode.attributes-19.3.2.1] |
ASSUMPTION_FAILURE
|
org.junit.AssumptionViolatedException: Test not enforced
|
| com.google.android.apps.yts.tvts.YtsReport#yts[DOMchardata,window&MiscellaneousTestsNodeNode.childNodes-19.3.3.1] |
ASSUMPTION_FAILURE
|
org.junit.AssumptionViolatedException: Test not enforced
|
| com.google.android.apps.yts.tvts.YtsReport#yts[DOMchardata,window&MiscellaneousTestsNodeNode.cloneNode-19.3.4.1] |
ASSUMPTION_FAILURE
|
org.junit.AssumptionViolatedException: Test not enforced
|
| com.google.android.apps.yts.tvts.YtsReport#yts[DOMchardata,window&MiscellaneousTestsNodeNode.firstChild-19.3.5.1] |
ASSUMPTION_FAILURE
|
org.junit.AssumptionViolatedException: Test not enforced
|
| com.google.android.apps.yts.tvts.YtsReport#yts[DOMchardata,window&MiscellaneousTestsNodeNode.getElementById-19.3.20.1] |
ASSUMPTION_FAILURE
|
org.junit.AssumptionViolatedException: Test not enforced
|
| com.google.android.apps.yts.tvts.YtsReport#yts[DOMchardata,window&MiscellaneousTestsNodeNode.hasChildNodes-19.3.7.1] |
ASSUMPTION_FAILURE
|
org.junit.AssumptionViolatedException: Test not enforced
|
| com.google.android.apps.yts.tvts.YtsReport#yts[DOMchardata,window&MiscellaneousTestsNodeNode.insertBefore-19.3.8.1] |
ASSUMPTION_FAILURE
|
org.junit.AssumptionViolatedException: Test not enforced
|
| com.google.android.apps.yts.tvts.YtsReport#yts[DOMchardata,window&MiscellaneousTestsNodeNode.lastChild-19.3.9.1] |
ASSUMPTION_FAILURE
|
org.junit.AssumptionViolatedException: Test not enforced
|
| com.google.android.apps.yts.tvts.YtsReport#yts[DOMchardata,window&MiscellaneousTestsNodeNode.localName-19.3.21.1] |
ASSUMPTION_FAILURE
|
org.junit.AssumptionViolatedException: Test not enforced
|
| com.google.android.apps.yts.tvts.YtsReport#yts[DOMchardata,window&MiscellaneousTestsNodeNode.nextSibling-19.3.10.1] |
ASSUMPTION_FAILURE
|
org.junit.AssumptionViolatedException: Test not enforced
|
| com.google.android.apps.yts.tvts.YtsReport#yts[DOMchardata,window&MiscellaneousTestsNodeNode.nodeName-19.3.11.1] |
ASSUMPTION_FAILURE
|
org.junit.AssumptionViolatedException: Test not enforced
|
| com.google.android.apps.yts.tvts.YtsReport#yts[DOMchardata,window&MiscellaneousTestsNodeNode.nodeType-19.3.12.1] |
ASSUMPTION_FAILURE
|
org.junit.AssumptionViolatedException: Test not enforced
|
| com.google.android.apps.yts.tvts.YtsReport#yts[DOMchardata,window&MiscellaneousTestsNodeNode.nodeValue-19.3.13.1] |
ASSUMPTION_FAILURE
|
org.junit.AssumptionViolatedException: Test not enforced
|
| com.google.android.apps.yts.tvts.YtsReport#yts[DOMchardata,window&MiscellaneousTestsNodeNode.ownerDocument-19.3.15.1] |
ASSUMPTION_FAILURE
|
org.junit.AssumptionViolatedException: Test not enforced
|
| com.google.android.apps.yts.tvts.YtsReport#yts[DOMchardata,window&MiscellaneousTestsNodeNode.parentNode-19.3.16.1] |
ASSUMPTION_FAILURE
|
org.junit.AssumptionViolatedException: Test not enforced
|
| com.google.android.apps.yts.tvts.YtsReport#yts[DOMchardata,window&MiscellaneousTestsNodeNode.previousSibling-19.3.17.1] |
ASSUMPTION_FAILURE
|
org.junit.AssumptionViolatedException: Test not enforced
|
| com.google.android.apps.yts.tvts.YtsReport#yts[DOMchardata,window&MiscellaneousTestsNodeNode.removeChild-19.3.18.1] |
ASSUMPTION_FAILURE
|
org.junit.AssumptionViolatedException: Test not enforced
|
| com.google.android.apps.yts.tvts.YtsReport#yts[DOMchardata,window&MiscellaneousTestsNodeNode.replaceChild-19.3.19.1] |
ASSUMPTION_FAILURE
|
org.junit.AssumptionViolatedException: Test not enforced
|
| com.google.android.apps.yts.tvts.YtsReport#yts[DOMchardata,window&MiscellaneousTestswindowWindow.devicePixelRatio-19.5.14.1] |
ASSUMPTION_FAILURE
|
org.junit.AssumptionViolatedException: Test not enforced
|
| com.google.android.apps.yts.tvts.YtsReport#yts[DOMchardata,window&MiscellaneousTestswindowWindow.onerrorstacktrace-19.5.13.1] |
ASSUMPTION_FAILURE
|
org.junit.AssumptionViolatedException: Test not enforced
|
| com.google.android.apps.yts.tvts.YtsReport#yts[DOMchardata,window&MiscellaneousTestswindowwindow.addEventListener-19.5.1.1] |
ASSUMPTION_FAILURE
|
org.junit.AssumptionViolatedException: Test not enforced
|
| com.google.android.apps.yts.tvts.YtsReport#yts[DOMchardata,window&MiscellaneousTestswindowwindow.clearInterval-19.5.2.1] |
ASSUMPTION_FAILURE
|
org.junit.AssumptionViolatedException: Test not enforced
|
| com.google.android.apps.yts.tvts.YtsReport#yts[DOMchardata,window&MiscellaneousTestswindowwindow.clearTimeout-19.5.3.1] |
ASSUMPTION_FAILURE
|
org.junit.AssumptionViolatedException: Test not enforced
|
| com.google.android.apps.yts.tvts.YtsReport#yts[DOMchardata,window&MiscellaneousTestswindowwindow.close-19.5.6.1] |
ASSUMPTION_FAILURE
|
org.junit.AssumptionViolatedException: Test not enforced
|
| com.google.android.apps.yts.tvts.YtsReport#yts[DOMchardata,window&MiscellaneousTestswindowwindow.keydown-19.5.10.1] |
ASSUMPTION_FAILURE
|
org.junit.AssumptionViolatedException: Test not enforced
|
| com.google.android.apps.yts.tvts.YtsReport#yts[DOMchardata,window&MiscellaneousTestswindowwindow.keypress-19.5.11.1] |
ASSUMPTION_FAILURE
|
org.junit.AssumptionViolatedException: Test not enforced
|
| com.google.android.apps.yts.tvts.YtsReport#yts[DOMchardata,window&MiscellaneousTestswindowwindow.keyup-19.5.12.1] |
ASSUMPTION_FAILURE
|
org.junit.AssumptionViolatedException: Test not enforced
|
| com.google.android.apps.yts.tvts.YtsReport#yts[DOMchardata,window&MiscellaneousTestswindowwindow.location-19.5.4.1] |
ASSUMPTION_FAILURE
|
org.junit.AssumptionViolatedException: Test not enforced
|
| com.google.android.apps.yts.tvts.YtsReport#yts[DOMchardata,window&MiscellaneousTestswindowwindow.navigator-19.5.5.1] |
ASSUMPTION_FAILURE
|
org.junit.AssumptionViolatedException: Test not enforced
|
| com.google.android.apps.yts.tvts.YtsReport#yts[DOMchardata,window&MiscellaneousTestswindowwindow.removeEventListener-19.5.7.1] |
ASSUMPTION_FAILURE
|
org.junit.AssumptionViolatedException: Test not enforced
|
| com.google.android.apps.yts.tvts.YtsReport#yts[DOMchardata,window&MiscellaneousTestswindowwindow.setInterval-19.5.8.1] |
ASSUMPTION_FAILURE
|
org.junit.AssumptionViolatedException: Test not enforced
|
| com.google.android.apps.yts.tvts.YtsReport#yts[DOMchardata,window&MiscellaneousTestswindowwindow.setTimeout-19.5.9.1] |
ASSUMPTION_FAILURE
|
org.junit.AssumptionViolatedException: Test not enforced
|
| com.google.android.apps.yts.tvts.YtsReport#yts[EMEConformanceTestsEncryptionSchemeAACAudioCbcs-3.5.14.1] |
ASSUMPTION_FAILURE
|
org.junit.AssumptionViolatedException: Test not enforced
|
| com.google.android.apps.yts.tvts.YtsReport#yts[EMEConformanceTestsEncryptionSchemeAACAudioCenc-3.5.12.1] |
ASSUMPTION_FAILURE
|
org.junit.AssumptionViolatedException: Test not enforced
|
| com.google.android.apps.yts.tvts.YtsReport#yts[EMEConformanceTestsEncryptionSchemeAACAudioInvalidScheme-3.5.15.1] |
ASSUMPTION_FAILURE
|
org.junit.AssumptionViolatedException: Test not enforced
|
| com.google.android.apps.yts.tvts.YtsReport#yts[EMEConformanceTestsEncryptionSchemeAACAudioUnsetScheme-3.5.13.1] |
ASSUMPTION_FAILURE
|
org.junit.AssumptionViolatedException: Test not enforced
|
| com.google.android.apps.yts.tvts.YtsReport#yts[EMEConformanceTestsEncryptionSchemeAC3AudioCbcs-3.5.18.1] |
ASSUMPTION_FAILURE
|
org.junit.AssumptionViolatedException: Test not enforced
|
| com.google.android.apps.yts.tvts.YtsReport#yts[EMEConformanceTestsEncryptionSchemeAV1VideoCbcs-3.5.9.1] |
ASSUMPTION_FAILURE
|
org.junit.AssumptionViolatedException: Test not enforced
|
| com.google.android.apps.yts.tvts.YtsReport#yts[EMEConformanceTestsEncryptionSchemeAV1VideoCbcsAACAudioCbcs-3.5.23.1] |
ASSUMPTION_FAILURE
|
org.junit.AssumptionViolatedException: Test not enforced
|
| com.google.android.apps.yts.tvts.YtsReport#yts[EMEConformanceTestsEncryptionSchemeAV1VideoCbcsAACAudioCenc-3.5.24.1] |
ASSUMPTION_FAILURE
|
org.junit.AssumptionViolatedException: Test not enforced
|
| com.google.android.apps.yts.tvts.YtsReport#yts[EMEConformanceTestsEncryptionSchemeAV1VideoInvalidScheme-3.5.11.1] |
ASSUMPTION_FAILURE
|
org.junit.AssumptionViolatedException: Test not enforced
|
| com.google.android.apps.yts.tvts.YtsReport#yts[EMEConformanceTestsEncryptionSchemeAV1VideoUnsetScheme-3.5.10.1] |
ASSUMPTION_FAILURE
|
org.junit.AssumptionViolatedException: Test not enforced
|
| com.google.android.apps.yts.tvts.YtsReport#yts[EMEConformanceTestsEncryptionSchemeEAC3AudioCbcs-3.5.3.1] |
ASSUMPTION_FAILURE
|
org.junit.AssumptionViolatedException: Test not enforced
|
| com.google.android.apps.yts.tvts.YtsReport#yts[EMEConformanceTestsEncryptionSchemeH264VideoCenc-3.5.1.1] |
ASSUMPTION_FAILURE
|
org.junit.AssumptionViolatedException: Test not enforced
|
| com.google.android.apps.yts.tvts.YtsReport#yts[EMEConformanceTestsEncryptionSchemeH264VideoCencAACAudioCenc-3.5.20.1] |
ASSUMPTION_FAILURE
|
org.junit.AssumptionViolatedException: Test not enforced
|
| com.google.android.apps.yts.tvts.YtsReport#yts[EMEConformanceTestsEncryptionSchemeH264VideoInvalidScheme-3.5.4.1] |
ASSUMPTION_FAILURE
|
org.junit.AssumptionViolatedException: Test not enforced
|
| com.google.android.apps.yts.tvts.YtsReport#yts[EMEConformanceTestsEncryptionSchemeH264VideoUnsetScheme-3.5.2.1] |
ASSUMPTION_FAILURE
|
org.junit.AssumptionViolatedException: Test not enforced
|
| com.google.android.apps.yts.tvts.YtsReport#yts[EMEConformanceTestsEncryptionSchemeOpusAudioCenc-3.5.16.1] |
ASSUMPTION_FAILURE
|
org.junit.AssumptionViolatedException: Test not enforced
|
| com.google.android.apps.yts.tvts.YtsReport#yts[EMEConformanceTestsEncryptionSchemeOpusAudioInvalidScheme-3.5.19.1] |
ASSUMPTION_FAILURE
|
org.junit.AssumptionViolatedException: Test not enforced
|
| com.google.android.apps.yts.tvts.YtsReport#yts[EMEConformanceTestsEncryptionSchemeOpusAudioUnsetScheme-3.5.17.1] |
ASSUMPTION_FAILURE
|
org.junit.AssumptionViolatedException: Test not enforced
|
| com.google.android.apps.yts.tvts.YtsReport#yts[EMEConformanceTestsEncryptionSchemeVP9VideoCbcs-3.5.7.1] |
ASSUMPTION_FAILURE
|
org.junit.AssumptionViolatedException: Test not enforced
|
| com.google.android.apps.yts.tvts.YtsReport#yts[EMEConformanceTestsEncryptionSchemeVP9VideoCbcsAACAudioCbcs-3.5.22.1] |
ASSUMPTION_FAILURE
|
org.junit.AssumptionViolatedException: Test not enforced
|
| com.google.android.apps.yts.tvts.YtsReport#yts[EMEConformanceTestsEncryptionSchemeVP9VideoCenc-3.5.5.1] |
ASSUMPTION_FAILURE
|
org.junit.AssumptionViolatedException: Test not enforced
|
| com.google.android.apps.yts.tvts.YtsReport#yts[EMEConformanceTestsEncryptionSchemeVP9VideoCencOpusAudioCenc-3.5.21.1] |
ASSUMPTION_FAILURE
|
org.junit.AssumptionViolatedException: Test not enforced
|
| com.google.android.apps.yts.tvts.YtsReport#yts[EMEConformanceTestsEncryptionSchemeVP9VideoInvalidScheme-3.5.8.1] |
ASSUMPTION_FAILURE
|
org.junit.AssumptionViolatedException: Test not enforced
|
| com.google.android.apps.yts.tvts.YtsReport#yts[EMEConformanceTestsEncryptionSchemeVP9VideoUnsetScheme-3.5.6.1] |
ASSUMPTION_FAILURE
|
org.junit.AssumptionViolatedException: Test not enforced
|
| com.google.android.apps.yts.tvts.YtsReport#yts[EMEConformanceTestsGeneralEncryptedEventData-3.3.1.1] |
ASSUMPTION_FAILURE
|
org.junit.AssumptionViolatedException: Test not enforced
|
| com.google.android.apps.yts.tvts.YtsReport#yts[EMEConformanceTestsWidevineWidevineH264MultiMediaKeySessions-3.1.6.1] |
ASSUMPTION_FAILURE
|
org.junit.AssumptionViolatedException: Test not enforced
|
| com.google.android.apps.yts.tvts.YtsReport#yts[EMEConformanceTestsWidevineWidevineLicenseDelayH264Video-3.1.7.1] |
ASSUMPTION_FAILURE
|
org.junit.AssumptionViolatedException: Test not enforced
|
| com.google.android.apps.yts.tvts.YtsReport#yts[EMEConformanceTestsWidevineWidevineLicenseDelayVP9Video-3.1.8.1] |
ASSUMPTION_FAILURE
|
org.junit.AssumptionViolatedException: Test not enforced
|
| com.google.android.apps.yts.tvts.YtsReport#yts[EMEConformanceTestsWidevinesetServerCertificate-3.1.10.2] |
ASSUMPTION_FAILURE
|
org.junit.AssumptionViolatedException: Test not enforced
|
| com.google.android.apps.yts.tvts.YtsReport#yts[EMEConformanceTestsWidevineAV1WidevineAV1.10bit.HLG.1080p.24fps-3.7.7.1] |
ASSUMPTION_FAILURE
|
org.junit.AssumptionViolatedException: Test not enforced
|
| com.google.android.apps.yts.tvts.YtsReport#yts[EMEConformanceTestsWidevineAV1WidevineAV1.10bit.HLG.1080p.60fps-3.7.8.1] |
ASSUMPTION_FAILURE
|
org.junit.AssumptionViolatedException: Test not enforced
|
| com.google.android.apps.yts.tvts.YtsReport#yts[EMEConformanceTestsWidevineAV1WidevineAV1.10bit.HLG.1440p.24fps-3.7.9.1] |
ASSUMPTION_FAILURE
|
org.junit.AssumptionViolatedException: Test not enforced
|
| com.google.android.apps.yts.tvts.YtsReport#yts[EMEConformanceTestsWidevineAV1WidevineAV1.10bit.HLG.1440p.60fps-3.7.10.1] |
ASSUMPTION_FAILURE
|
org.junit.AssumptionViolatedException: Test not enforced
|
| com.google.android.apps.yts.tvts.YtsReport#yts[EMEConformanceTestsWidevineAV1WidevineAV1.10bit.HLG.144p.30fps-3.7.1.1] |
ASSUMPTION_FAILURE
|
org.junit.AssumptionViolatedException: Test not enforced
|
| com.google.android.apps.yts.tvts.YtsReport#yts[EMEConformanceTestsWidevineAV1WidevineAV1.10bit.HLG.2160p.24fps(required)-3.7.11.2] |
ASSUMPTION_FAILURE
|
org.junit.AssumptionViolatedException: Test not enforced
|
| com.google.android.apps.yts.tvts.YtsReport#yts[EMEConformanceTestsWidevineAV1WidevineAV1.10bit.HLG.2160p.60fps(required)-3.7.12.2] |
ASSUMPTION_FAILURE
|
org.junit.AssumptionViolatedException: Test not enforced
|
| com.google.android.apps.yts.tvts.YtsReport#yts[EMEConformanceTestsWidevineAV1WidevineAV1.10bit.HLG.240p.30fps-3.7.2.1] |
ASSUMPTION_FAILURE
|
org.junit.AssumptionViolatedException: Test not enforced
|
| com.google.android.apps.yts.tvts.YtsReport#yts[EMEConformanceTestsWidevineAV1WidevineAV1.10bit.HLG.360p.30fps-3.7.3.1] |
ASSUMPTION_FAILURE
|
org.junit.AssumptionViolatedException: Test not enforced
|
| com.google.android.apps.yts.tvts.YtsReport#yts[EMEConformanceTestsWidevineAV1WidevineAV1.10bit.HLG.480p.30fps-3.7.4.1] |
ASSUMPTION_FAILURE
|
org.junit.AssumptionViolatedException: Test not enforced
|
| com.google.android.apps.yts.tvts.YtsReport#yts[EMEConformanceTestsWidevineAV1WidevineAV1.10bit.HLG.720p.24fps-3.7.5.1] |
ASSUMPTION_FAILURE
|
org.junit.AssumptionViolatedException: Test not enforced
|
| com.google.android.apps.yts.tvts.YtsReport#yts[EMEConformanceTestsWidevineAV1WidevineAV1.10bit.HLG.720p.60fps-3.7.6.1] |
ASSUMPTION_FAILURE
|
org.junit.AssumptionViolatedException: Test not enforced
|
| com.google.android.apps.yts.tvts.YtsReport#yts[EMEConformanceTestsWidevineAV1WidevineAV1.10bit.PQ.1080p.24fps-3.8.7.1] |
ASSUMPTION_FAILURE
|
org.junit.AssumptionViolatedException: Test not enforced
|
| com.google.android.apps.yts.tvts.YtsReport#yts[EMEConformanceTestsWidevineAV1WidevineAV1.10bit.PQ.1080p.60fps-3.8.8.1] |
ASSUMPTION_FAILURE
|
org.junit.AssumptionViolatedException: Test not enforced
|
| com.google.android.apps.yts.tvts.YtsReport#yts[EMEConformanceTestsWidevineAV1WidevineAV1.10bit.PQ.1440p.24fps-3.8.9.1] |
ASSUMPTION_FAILURE
|
org.junit.AssumptionViolatedException: Test not enforced
|
| com.google.android.apps.yts.tvts.YtsReport#yts[EMEConformanceTestsWidevineAV1WidevineAV1.10bit.PQ.1440p.60fps-3.8.10.1] |
ASSUMPTION_FAILURE
|
org.junit.AssumptionViolatedException: Test not enforced
|
| com.google.android.apps.yts.tvts.YtsReport#yts[EMEConformanceTestsWidevineAV1WidevineAV1.10bit.PQ.144p.30fps-3.8.1.1] |
ASSUMPTION_FAILURE
|
org.junit.AssumptionViolatedException: Test not enforced
|
| com.google.android.apps.yts.tvts.YtsReport#yts[EMEConformanceTestsWidevineAV1WidevineAV1.10bit.PQ.2160p.24fps(required)-3.8.11.2] |
ASSUMPTION_FAILURE
|
org.junit.AssumptionViolatedException: Test not enforced
|
| com.google.android.apps.yts.tvts.YtsReport#yts[EMEConformanceTestsWidevineAV1WidevineAV1.10bit.PQ.2160p.60fps(required)-3.8.12.2] |
ASSUMPTION_FAILURE
|
org.junit.AssumptionViolatedException: Test not enforced
|
| com.google.android.apps.yts.tvts.YtsReport#yts[EMEConformanceTestsWidevineAV1WidevineAV1.10bit.PQ.240p.30fps-3.8.2.1] |
ASSUMPTION_FAILURE
|
org.junit.AssumptionViolatedException: Test not enforced
|
| com.google.android.apps.yts.tvts.YtsReport#yts[EMEConformanceTestsWidevineAV1WidevineAV1.10bit.PQ.360p.30fps-3.8.3.1] |
ASSUMPTION_FAILURE
|
org.junit.AssumptionViolatedException: Test not enforced
|
| com.google.android.apps.yts.tvts.YtsReport#yts[EMEConformanceTestsWidevineAV1WidevineAV1.10bit.PQ.480p.30fps-3.8.4.1] |
ASSUMPTION_FAILURE
|
org.junit.AssumptionViolatedException: Test not enforced
|
| com.google.android.apps.yts.tvts.YtsReport#yts[EMEConformanceTestsWidevineAV1WidevineAV1.10bit.PQ.720p.24fps-3.8.5.1] |
ASSUMPTION_FAILURE
|
org.junit.AssumptionViolatedException: Test not enforced
|
| com.google.android.apps.yts.tvts.YtsReport#yts[EMEConformanceTestsWidevineAV1WidevineAV1.10bit.PQ.720p.60fps-3.8.6.1] |
ASSUMPTION_FAILURE
|
org.junit.AssumptionViolatedException: Test not enforced
|
| com.google.android.apps.yts.tvts.YtsReport#yts[EMEConformanceTestsWidevineAV1WidevineAV1.8bit.BT709.1080p.30fps-3.6.7.1] |
ASSUMPTION_FAILURE
|
org.junit.AssumptionViolatedException: Test not enforced
|
| com.google.android.apps.yts.tvts.YtsReport#yts[EMEConformanceTestsWidevineAV1WidevineAV1.8bit.BT709.1080p.60fps-3.6.8.1] |
ASSUMPTION_FAILURE
|
org.junit.AssumptionViolatedException: Test not enforced
|
| com.google.android.apps.yts.tvts.YtsReport#yts[EMEConformanceTestsWidevineAV1WidevineAV1.8bit.BT709.1440p.30fps-3.6.9.1] |
ASSUMPTION_FAILURE
|
org.junit.AssumptionViolatedException: Test not enforced
|
| com.google.android.apps.yts.tvts.YtsReport#yts[EMEConformanceTestsWidevineAV1WidevineAV1.8bit.BT709.1440p.60fps-3.6.10.1] |
ASSUMPTION_FAILURE
|
org.junit.AssumptionViolatedException: Test not enforced
|
| com.google.android.apps.yts.tvts.YtsReport#yts[EMEConformanceTestsWidevineAV1WidevineAV1.8bit.BT709.144p.30fps-3.6.1.1] |
ASSUMPTION_FAILURE
|
org.junit.AssumptionViolatedException: Test not enforced
|
| com.google.android.apps.yts.tvts.YtsReport#yts[EMEConformanceTestsWidevineAV1WidevineAV1.8bit.BT709.2160p.30fps(required)-3.6.11.2] |
ASSUMPTION_FAILURE
|
org.junit.AssumptionViolatedException: Test not enforced
|
| com.google.android.apps.yts.tvts.YtsReport#yts[EMEConformanceTestsWidevineAV1WidevineAV1.8bit.BT709.2160p.60fps(required)-3.6.12.2] |
ASSUMPTION_FAILURE
|
org.junit.AssumptionViolatedException: Test not enforced
|
| com.google.android.apps.yts.tvts.YtsReport#yts[EMEConformanceTestsWidevineAV1WidevineAV1.8bit.BT709.240p.30fps-3.6.2.1] |
ASSUMPTION_FAILURE
|
org.junit.AssumptionViolatedException: Test not enforced
|
| com.google.android.apps.yts.tvts.YtsReport#yts[EMEConformanceTestsWidevineAV1WidevineAV1.8bit.BT709.360p.30fps-3.6.3.1] |
ASSUMPTION_FAILURE
|
org.junit.AssumptionViolatedException: Test not enforced
|
| com.google.android.apps.yts.tvts.YtsReport#yts[EMEConformanceTestsWidevineAV1WidevineAV1.8bit.BT709.480p.30fps-3.6.4.1] |
ASSUMPTION_FAILURE
|
org.junit.AssumptionViolatedException: Test not enforced
|
| com.google.android.apps.yts.tvts.YtsReport#yts[EMEConformanceTestsWidevineAV1WidevineAV1.8bit.BT709.720p.30fps-3.6.5.1] |
ASSUMPTION_FAILURE
|
org.junit.AssumptionViolatedException: Test not enforced
|
| com.google.android.apps.yts.tvts.YtsReport#yts[EMEConformanceTestsWidevineAV1WidevineAV1.8bit.BT709.720p.60fps-3.6.6.1] |
ASSUMPTION_FAILURE
|
org.junit.AssumptionViolatedException: Test not enforced
|
| com.google.android.apps.yts.tvts.YtsReport#yts[EMEConformanceTestswidevinewidevineAACaudio-3.1.2.1] |
ASSUMPTION_FAILURE
|
org.junit.AssumptionViolatedException: Test not enforced
|
| com.google.android.apps.yts.tvts.YtsReport#yts[EMEConformanceTestswidevinewidevineH264video-3.1.1.1] |
ASSUMPTION_FAILURE
|
org.junit.AssumptionViolatedException: Test not enforced
|
| com.google.android.apps.yts.tvts.YtsReport#yts[EMEConformanceTestswidevinewidevineOpusaudio-3.1.3.1] |
ASSUMPTION_FAILURE
|
org.junit.AssumptionViolatedException: Test not enforced
|
| com.google.android.apps.yts.tvts.YtsReport#yts[EMEConformanceTestswidevinewidevineVP9Subsamplevideo-3.1.5.1] |
ASSUMPTION_FAILURE
|
org.junit.AssumptionViolatedException: Test not enforced
|
| com.google.android.apps.yts.tvts.YtsReport#yts[EMEConformanceTestswidevinewidevineVP9video-3.1.4.1] |
ASSUMPTION_FAILURE
|
org.junit.AssumptionViolatedException: Test not enforced
|
| com.google.android.apps.yts.tvts.YtsReport#yts[FormatSupportTestsAV1AV1.10Bit.HLG.1080p24-20.7.20.1] |
ASSUMPTION_FAILURE
|
org.junit.AssumptionViolatedException: Test not enforced
|
| com.google.android.apps.yts.tvts.YtsReport#yts[FormatSupportTestsAV1AV1.10Bit.HLG.1080p60-20.7.21.1] |
ASSUMPTION_FAILURE
|
org.junit.AssumptionViolatedException: Test not enforced
|
| com.google.android.apps.yts.tvts.YtsReport#yts[FormatSupportTestsAV1AV1.10Bit.HLG.1440p24-20.7.22.1] |
ASSUMPTION_FAILURE
|
org.junit.AssumptionViolatedException: Test not enforced
|
| com.google.android.apps.yts.tvts.YtsReport#yts[FormatSupportTestsAV1AV1.10Bit.HLG.1440p60-20.7.23.1] |
ASSUMPTION_FAILURE
|
org.junit.AssumptionViolatedException: Test not enforced
|
| com.google.android.apps.yts.tvts.YtsReport#yts[FormatSupportTestsAV1AV1.10Bit.HLG.144p30-20.7.14.1] |
ASSUMPTION_FAILURE
|
org.junit.AssumptionViolatedException: Test not enforced
|
| com.google.android.apps.yts.tvts.YtsReport#yts[FormatSupportTestsAV1AV1.10Bit.HLG.2160p24-20.7.24.1] |
ASSUMPTION_FAILURE
|
org.junit.AssumptionViolatedException: Test not enforced
|
| com.google.android.apps.yts.tvts.YtsReport#yts[FormatSupportTestsAV1AV1.10Bit.HLG.2160p60-20.7.25.1] |
ASSUMPTION_FAILURE
|
org.junit.AssumptionViolatedException: Test not enforced
|
| com.google.android.apps.yts.tvts.YtsReport#yts[FormatSupportTestsAV1AV1.10Bit.HLG.240p30-20.7.15.1] |
ASSUMPTION_FAILURE
|
org.junit.AssumptionViolatedException: Test not enforced
|
| com.google.android.apps.yts.tvts.YtsReport#yts[FormatSupportTestsAV1AV1.10Bit.HLG.360p30-20.7.16.1] |
ASSUMPTION_FAILURE
|
org.junit.AssumptionViolatedException: Test not enforced
|
| com.google.android.apps.yts.tvts.YtsReport#yts[FormatSupportTestsAV1AV1.10Bit.HLG.480p30-20.7.17.1] |
ASSUMPTION_FAILURE
|
org.junit.AssumptionViolatedException: Test not enforced
|
| com.google.android.apps.yts.tvts.YtsReport#yts[FormatSupportTestsAV1AV1.10Bit.HLG.720p24-20.7.18.1] |
ASSUMPTION_FAILURE
|
org.junit.AssumptionViolatedException: Test not enforced
|
| com.google.android.apps.yts.tvts.YtsReport#yts[FormatSupportTestsAV1AV1.10Bit.HLG.720p60-20.7.19.1] |
ASSUMPTION_FAILURE
|
org.junit.AssumptionViolatedException: Test not enforced
|
| com.google.android.apps.yts.tvts.YtsReport#yts[FormatSupportTestsAV1AV1.10Bit.PQ.1080p24-20.7.32.1] |
ASSUMPTION_FAILURE
|
org.junit.AssumptionViolatedException: Test not enforced
|
| com.google.android.apps.yts.tvts.YtsReport#yts[FormatSupportTestsAV1AV1.10Bit.PQ.1080p60-20.7.33.1] |
ASSUMPTION_FAILURE
|
org.junit.AssumptionViolatedException: Test not enforced
|
| com.google.android.apps.yts.tvts.YtsReport#yts[FormatSupportTestsAV1AV1.10Bit.PQ.1440p24-20.7.34.1] |
ASSUMPTION_FAILURE
|
org.junit.AssumptionViolatedException: Test not enforced
|
| com.google.android.apps.yts.tvts.YtsReport#yts[FormatSupportTestsAV1AV1.10Bit.PQ.1440p60-20.7.35.1] |
ASSUMPTION_FAILURE
|
org.junit.AssumptionViolatedException: Test not enforced
|
| com.google.android.apps.yts.tvts.YtsReport#yts[FormatSupportTestsAV1AV1.10Bit.PQ.144p30-20.7.26.1] |
ASSUMPTION_FAILURE
|
org.junit.AssumptionViolatedException: Test not enforced
|
| com.google.android.apps.yts.tvts.YtsReport#yts[FormatSupportTestsAV1AV1.10Bit.PQ.2160p24-20.7.36.1] |
ASSUMPTION_FAILURE
|
org.junit.AssumptionViolatedException: Test not enforced
|
| com.google.android.apps.yts.tvts.YtsReport#yts[FormatSupportTestsAV1AV1.10Bit.PQ.2160p60-20.7.37.1] |
ASSUMPTION_FAILURE
|
org.junit.AssumptionViolatedException: Test not enforced
|
| com.google.android.apps.yts.tvts.YtsReport#yts[FormatSupportTestsAV1AV1.10Bit.PQ.240p30-20.7.27.1] |
ASSUMPTION_FAILURE
|
org.junit.AssumptionViolatedException: Test not enforced
|
| com.google.android.apps.yts.tvts.YtsReport#yts[FormatSupportTestsAV1AV1.10Bit.PQ.360p30-20.7.28.1] |
ASSUMPTION_FAILURE
|
org.junit.AssumptionViolatedException: Test not enforced
|
| com.google.android.apps.yts.tvts.YtsReport#yts[FormatSupportTestsAV1AV1.10Bit.PQ.480p30-20.7.29.1] |
ASSUMPTION_FAILURE
|
org.junit.AssumptionViolatedException: Test not enforced
|
| com.google.android.apps.yts.tvts.YtsReport#yts[FormatSupportTestsAV1AV1.10Bit.PQ.720p24-20.7.30.1] |
ASSUMPTION_FAILURE
|
org.junit.AssumptionViolatedException: Test not enforced
|
| com.google.android.apps.yts.tvts.YtsReport#yts[FormatSupportTestsAV1AV1.10Bit.PQ.720p60-20.7.31.1] |
ASSUMPTION_FAILURE
|
org.junit.AssumptionViolatedException: Test not enforced
|
| com.google.android.apps.yts.tvts.YtsReport#yts[FormatSupportTestsAV1AV1.8Bit.BT709.1080p30-20.7.7.1] |
ASSUMPTION_FAILURE
|
org.junit.AssumptionViolatedException: Test not enforced
|
| com.google.android.apps.yts.tvts.YtsReport#yts[FormatSupportTestsAV1AV1.8Bit.BT709.1080p60-20.7.8.1] |
ASSUMPTION_FAILURE
|
org.junit.AssumptionViolatedException: Test not enforced
|
| com.google.android.apps.yts.tvts.YtsReport#yts[FormatSupportTestsAV1AV1.8Bit.BT709.1440p30-20.7.9.1] |
ASSUMPTION_FAILURE
|
org.junit.AssumptionViolatedException: Test not enforced
|
| com.google.android.apps.yts.tvts.YtsReport#yts[FormatSupportTestsAV1AV1.8Bit.BT709.1440p60-20.7.10.1] |
ASSUMPTION_FAILURE
|
org.junit.AssumptionViolatedException: Test not enforced
|
| com.google.android.apps.yts.tvts.YtsReport#yts[FormatSupportTestsAV1AV1.8Bit.BT709.144p30-20.7.1.1] |
ASSUMPTION_FAILURE
|
org.junit.AssumptionViolatedException: Test not enforced
|
| com.google.android.apps.yts.tvts.YtsReport#yts[FormatSupportTestsAV1AV1.8Bit.BT709.2160p30-20.7.11.1] |
ASSUMPTION_FAILURE
|
org.junit.AssumptionViolatedException: Test not enforced
|
| com.google.android.apps.yts.tvts.YtsReport#yts[FormatSupportTestsAV1AV1.8Bit.BT709.2160p60-20.7.12.1] |
ASSUMPTION_FAILURE
|
org.junit.AssumptionViolatedException: Test not enforced
|
| com.google.android.apps.yts.tvts.YtsReport#yts[FormatSupportTestsAV1AV1.8Bit.BT709.240p30-20.7.2.1] |
ASSUMPTION_FAILURE
|
org.junit.AssumptionViolatedException: Test not enforced
|
| com.google.android.apps.yts.tvts.YtsReport#yts[FormatSupportTestsAV1AV1.8Bit.BT709.360p30-20.7.3.1] |
ASSUMPTION_FAILURE
|
org.junit.AssumptionViolatedException: Test not enforced
|
| com.google.android.apps.yts.tvts.YtsReport#yts[FormatSupportTestsAV1AV1.8Bit.BT709.480p30-20.7.4.1] |
ASSUMPTION_FAILURE
|
org.junit.AssumptionViolatedException: Test not enforced
|
| com.google.android.apps.yts.tvts.YtsReport#yts[FormatSupportTestsAV1AV1.8Bit.BT709.720p30-20.7.5.1] |
ASSUMPTION_FAILURE
|
org.junit.AssumptionViolatedException: Test not enforced
|
| com.google.android.apps.yts.tvts.YtsReport#yts[FormatSupportTestsAV1AV1.8Bit.BT709.720p60-20.7.6.1] |
ASSUMPTION_FAILURE
|
org.junit.AssumptionViolatedException: Test not enforced
|
| com.google.android.apps.yts.tvts.YtsReport#yts[FormatSupportTestsMIMETypeSupportAACSupport-20.5.1.1] |
ASSUMPTION_FAILURE
|
org.junit.AssumptionViolatedException: Test not enforced
|
| com.google.android.apps.yts.tvts.YtsReport#yts[FormatSupportTestsMIMETypeSupportAC3Support-20.5.5.1] |
ASSUMPTION_FAILURE
|
org.junit.AssumptionViolatedException: Test not enforced
|
| com.google.android.apps.yts.tvts.YtsReport#yts[FormatSupportTestsMIMETypeSupportAV1Long-FormSupport-20.5.10.1] |
ASSUMPTION_FAILURE
|
org.junit.AssumptionViolatedException: Test not enforced
|
| com.google.android.apps.yts.tvts.YtsReport#yts[FormatSupportTestsMIMETypeSupportAV1Short-FormSupport-20.5.9.1] |
ASSUMPTION_FAILURE
|
org.junit.AssumptionViolatedException: Test not enforced
|
| com.google.android.apps.yts.tvts.YtsReport#yts[FormatSupportTestsMIMETypeSupportEAC3Support-20.5.6.1] |
ASSUMPTION_FAILURE
|
org.junit.AssumptionViolatedException: Test not enforced
|
| com.google.android.apps.yts.tvts.YtsReport#yts[FormatSupportTestsMIMETypeSupportH264Support-20.5.2.1] |
ASSUMPTION_FAILURE
|
org.junit.AssumptionViolatedException: Test not enforced
|
| com.google.android.apps.yts.tvts.YtsReport#yts[FormatSupportTestsMIMETypeSupportOpusSupport-20.5.4.1] |
ASSUMPTION_FAILURE
|
org.junit.AssumptionViolatedException: Test not enforced
|
| com.google.android.apps.yts.tvts.YtsReport#yts[FormatSupportTestsMIMETypeSupportVP9Long-FormSupport-20.5.8.1] |
ASSUMPTION_FAILURE
|
org.junit.AssumptionViolatedException: Test not enforced
|
| com.google.android.apps.yts.tvts.YtsReport#yts[FormatSupportTestsMIMETypeSupportVP9Medium-FormSupport-20.5.7.1] |
ASSUMPTION_FAILURE
|
org.junit.AssumptionViolatedException: Test not enforced
|
| com.google.android.apps.yts.tvts.YtsReport#yts[FormatSupportTestsMIMETypeSupportVP9Short-FormSupport-20.5.3.2] |
ASSUMPTION_FAILURE
|
org.junit.AssumptionViolatedException: Test not enforced
|
| com.google.android.apps.yts.tvts.YtsReport#yts[FormatSupportTestsMediaAAC5.1-20.6.4.1] |
ASSUMPTION_FAILURE
|
org.junit.AssumptionViolatedException: Test not enforced
|
| com.google.android.apps.yts.tvts.YtsReport#yts[FormatSupportTestsMediaAC35.1-20.6.5.1] |
ASSUMPTION_FAILURE
|
org.junit.AssumptionViolatedException: Test not enforced
|
| com.google.android.apps.yts.tvts.YtsReport#yts[FormatSupportTestsMediaEAC35.1-20.6.6.1] |
ASSUMPTION_FAILURE
|
org.junit.AssumptionViolatedException: Test not enforced
|
| com.google.android.apps.yts.tvts.YtsReport#yts[FormatSupportTestsMediaOpus5.1-20.6.3.1] |
ASSUMPTION_FAILURE
|
org.junit.AssumptionViolatedException: Test not enforced
|
| com.google.android.apps.yts.tvts.YtsReport#yts[FormatSupportTestsSupportAV1120fpsSupport-20.1.9.1] |
ASSUMPTION_FAILURE
|
org.junit.AssumptionViolatedException: Test not enforced
|
| com.google.android.apps.yts.tvts.YtsReport#yts[FormatSupportTestsSupportAV160fpsSupport-20.1.6.1] |
ASSUMPTION_FAILURE
|
org.junit.AssumptionViolatedException: Test not enforced
|
| com.google.android.apps.yts.tvts.YtsReport#yts[FormatSupportTestsSupportH.264120fpsSupport-20.1.7.1] |
ASSUMPTION_FAILURE
|
org.junit.AssumptionViolatedException: Test not enforced
|
| com.google.android.apps.yts.tvts.YtsReport#yts[FormatSupportTestsSupportH.26460fpsSupport-20.1.4.1] |
ASSUMPTION_FAILURE
|
org.junit.AssumptionViolatedException: Test not enforced
|
| com.google.android.apps.yts.tvts.YtsReport#yts[FormatSupportTestsSupportVP9120fpsSupport-20.1.8.2] |
ASSUMPTION_FAILURE
|
org.junit.AssumptionViolatedException: Test not enforced
|
| com.google.android.apps.yts.tvts.YtsReport#yts[FormatSupportTestsSupportVP960fpsSupport-20.1.5.2] |
ASSUMPTION_FAILURE
|
org.junit.AssumptionViolatedException: Test not enforced
|
| com.google.android.apps.yts.tvts.YtsReport#yts[FormatSupportTestsSupportVP9Spherical(decode-to-texture)Support-20.1.14.2] |
ASSUMPTION_FAILURE
|
org.junit.AssumptionViolatedException: Test not enforced
|
| com.google.android.apps.yts.tvts.YtsReport#yts[FormatSupportTestsSupportVP9.2ARIBSTD-B67Support-20.1.12.2] |
ASSUMPTION_FAILURE
|
org.junit.AssumptionViolatedException: Test not enforced
|
| com.google.android.apps.yts.tvts.YtsReport#yts[FormatSupportTestsSupportVP9.2SMPTE2084Support-20.1.11.2] |
ASSUMPTION_FAILURE
|
org.junit.AssumptionViolatedException: Test not enforced
|
| com.google.android.apps.yts.tvts.YtsReport#yts[FormatSupportTestsSupportisTypeSupportedAV1Codec-20.1.3.1] |
ASSUMPTION_FAILURE
|
org.junit.AssumptionViolatedException: Test not enforced
|
| com.google.android.apps.yts.tvts.YtsReport#yts[FormatSupportTestsSupportisTypeSupportedEOTFSupport-20.1.10.2] |
ASSUMPTION_FAILURE
|
org.junit.AssumptionViolatedException: Test not enforced
|
| com.google.android.apps.yts.tvts.YtsReport#yts[FormatSupportTestsSupportisTypeSupportedExtensions-20.1.2.1] |
ASSUMPTION_FAILURE
|
org.junit.AssumptionViolatedException: Test not enforced
|
| com.google.android.apps.yts.tvts.YtsReport#yts[FormatSupportTestsSupportisTypeSupportedcryptoblockformat-20.1.1.2] |
ASSUMPTION_FAILURE
|
org.junit.AssumptionViolatedException: Test not enforced
|
| com.google.android.apps.yts.tvts.YtsReport#yts[FormatSupportTestsVP9HDRVP9.Profile2.10Bit.HLG.1080p30-20.4.6.1] |
ASSUMPTION_FAILURE
|
org.junit.AssumptionViolatedException: Test not enforced
|
| com.google.android.apps.yts.tvts.YtsReport#yts[FormatSupportTestsVP9HDRVP9.Profile2.10Bit.HLG.1080p60-20.4.14.1] |
ASSUMPTION_FAILURE
|
org.junit.AssumptionViolatedException: Test not enforced
|
| com.google.android.apps.yts.tvts.YtsReport#yts[FormatSupportTestsVP9HDRVP9.Profile2.10Bit.HLG.1440p30-20.4.7.1] |
ASSUMPTION_FAILURE
|
org.junit.AssumptionViolatedException: Test not enforced
|
| com.google.android.apps.yts.tvts.YtsReport#yts[FormatSupportTestsVP9HDRVP9.Profile2.10Bit.HLG.1440p60-20.4.15.1] |
ASSUMPTION_FAILURE
|
org.junit.AssumptionViolatedException: Test not enforced
|
| com.google.android.apps.yts.tvts.YtsReport#yts[FormatSupportTestsVP9HDRVP9.Profile2.10Bit.HLG.144p30-20.4.1.1] |
ASSUMPTION_FAILURE
|
org.junit.AssumptionViolatedException: Test not enforced
|
| com.google.android.apps.yts.tvts.YtsReport#yts[FormatSupportTestsVP9HDRVP9.Profile2.10Bit.HLG.144p60-20.4.9.1] |
ASSUMPTION_FAILURE
|
org.junit.AssumptionViolatedException: Test not enforced
|
| com.google.android.apps.yts.tvts.YtsReport#yts[FormatSupportTestsVP9HDRVP9.Profile2.10Bit.HLG.2160p30-20.4.8.1] |
ASSUMPTION_FAILURE
|
org.junit.AssumptionViolatedException: Test not enforced
|
| com.google.android.apps.yts.tvts.YtsReport#yts[FormatSupportTestsVP9HDRVP9.Profile2.10Bit.HLG.2160p60-20.4.16.1] |
ASSUMPTION_FAILURE
|
org.junit.AssumptionViolatedException: Test not enforced
|
| com.google.android.apps.yts.tvts.YtsReport#yts[FormatSupportTestsVP9HDRVP9.Profile2.10Bit.HLG.240p30-20.4.2.1] |
ASSUMPTION_FAILURE
|
org.junit.AssumptionViolatedException: Test not enforced
|
| com.google.android.apps.yts.tvts.YtsReport#yts[FormatSupportTestsVP9HDRVP9.Profile2.10Bit.HLG.240p60-20.4.10.1] |
ASSUMPTION_FAILURE
|
org.junit.AssumptionViolatedException: Test not enforced
|
| com.google.android.apps.yts.tvts.YtsReport#yts[FormatSupportTestsVP9HDRVP9.Profile2.10Bit.HLG.360p30-20.4.3.1] |
ASSUMPTION_FAILURE
|
org.junit.AssumptionViolatedException: Test not enforced
|
| com.google.android.apps.yts.tvts.YtsReport#yts[FormatSupportTestsVP9HDRVP9.Profile2.10Bit.HLG.360p60-20.4.11.1] |
ASSUMPTION_FAILURE
|
org.junit.AssumptionViolatedException: Test not enforced
|
| com.google.android.apps.yts.tvts.YtsReport#yts[FormatSupportTestsVP9HDRVP9.Profile2.10Bit.HLG.480p30-20.4.4.1] |
ASSUMPTION_FAILURE
|
org.junit.AssumptionViolatedException: Test not enforced
|
| com.google.android.apps.yts.tvts.YtsReport#yts[FormatSupportTestsVP9HDRVP9.Profile2.10Bit.HLG.480p60-20.4.12.1] |
ASSUMPTION_FAILURE
|
org.junit.AssumptionViolatedException: Test not enforced
|
| com.google.android.apps.yts.tvts.YtsReport#yts[FormatSupportTestsVP9HDRVP9.Profile2.10Bit.HLG.720p30-20.4.5.1] |
ASSUMPTION_FAILURE
|
org.junit.AssumptionViolatedException: Test not enforced
|
| com.google.android.apps.yts.tvts.YtsReport#yts[FormatSupportTestsVP9HDRVP9.Profile2.10Bit.HLG.720p60-20.4.13.1] |
ASSUMPTION_FAILURE
|
org.junit.AssumptionViolatedException: Test not enforced
|
| com.google.android.apps.yts.tvts.YtsReport#yts[FormatSupportTestsVP9HDRVP9.Profile2.10Bit.PQ.1080p30-20.4.22.1] |
ASSUMPTION_FAILURE
|
org.junit.AssumptionViolatedException: Test not enforced
|
| com.google.android.apps.yts.tvts.YtsReport#yts[FormatSupportTestsVP9HDRVP9.Profile2.10Bit.PQ.1080p60-20.4.30.1] |
ASSUMPTION_FAILURE
|
org.junit.AssumptionViolatedException: Test not enforced
|
| com.google.android.apps.yts.tvts.YtsReport#yts[FormatSupportTestsVP9HDRVP9.Profile2.10Bit.PQ.1440p30-20.4.23.1] |
ASSUMPTION_FAILURE
|
org.junit.AssumptionViolatedException: Test not enforced
|
| com.google.android.apps.yts.tvts.YtsReport#yts[FormatSupportTestsVP9HDRVP9.Profile2.10Bit.PQ.1440p60-20.4.31.1] |
ASSUMPTION_FAILURE
|
org.junit.AssumptionViolatedException: Test not enforced
|
| com.google.android.apps.yts.tvts.YtsReport#yts[FormatSupportTestsVP9HDRVP9.Profile2.10Bit.PQ.144p30-20.4.17.1] |
ASSUMPTION_FAILURE
|
org.junit.AssumptionViolatedException: Test not enforced
|
| com.google.android.apps.yts.tvts.YtsReport#yts[FormatSupportTestsVP9HDRVP9.Profile2.10Bit.PQ.144p60-20.4.25.1] |
ASSUMPTION_FAILURE
|
org.junit.AssumptionViolatedException: Test not enforced
|
| com.google.android.apps.yts.tvts.YtsReport#yts[FormatSupportTestsVP9HDRVP9.Profile2.10Bit.PQ.2160p30-20.4.24.1] |
ASSUMPTION_FAILURE
|
org.junit.AssumptionViolatedException: Test not enforced
|
| com.google.android.apps.yts.tvts.YtsReport#yts[FormatSupportTestsVP9HDRVP9.Profile2.10Bit.PQ.2160p60-20.4.32.1] |
ASSUMPTION_FAILURE
|
org.junit.AssumptionViolatedException: Test not enforced
|
| com.google.android.apps.yts.tvts.YtsReport#yts[FormatSupportTestsVP9HDRVP9.Profile2.10Bit.PQ.240p30-20.4.18.1] |
ASSUMPTION_FAILURE
|
org.junit.AssumptionViolatedException: Test not enforced
|
| com.google.android.apps.yts.tvts.YtsReport#yts[FormatSupportTestsVP9HDRVP9.Profile2.10Bit.PQ.240p60-20.4.26.1] |
ASSUMPTION_FAILURE
|
org.junit.AssumptionViolatedException: Test not enforced
|
| com.google.android.apps.yts.tvts.YtsReport#yts[FormatSupportTestsVP9HDRVP9.Profile2.10Bit.PQ.360p30-20.4.19.1] |
ASSUMPTION_FAILURE
|
org.junit.AssumptionViolatedException: Test not enforced
|
| com.google.android.apps.yts.tvts.YtsReport#yts[FormatSupportTestsVP9HDRVP9.Profile2.10Bit.PQ.360p60-20.4.27.1] |
ASSUMPTION_FAILURE
|
org.junit.AssumptionViolatedException: Test not enforced
|
| com.google.android.apps.yts.tvts.YtsReport#yts[FormatSupportTestsVP9HDRVP9.Profile2.10Bit.PQ.480p30-20.4.20.1] |
ASSUMPTION_FAILURE
|
org.junit.AssumptionViolatedException: Test not enforced
|
| com.google.android.apps.yts.tvts.YtsReport#yts[FormatSupportTestsVP9HDRVP9.Profile2.10Bit.PQ.480p60-20.4.28.1] |
ASSUMPTION_FAILURE
|
org.junit.AssumptionViolatedException: Test not enforced
|
| com.google.android.apps.yts.tvts.YtsReport#yts[FormatSupportTestsVP9HDRVP9.Profile2.10Bit.PQ.720p30-20.4.21.1] |
ASSUMPTION_FAILURE
|
org.junit.AssumptionViolatedException: Test not enforced
|
| com.google.android.apps.yts.tvts.YtsReport#yts[FormatSupportTestsVP9HDRVP9.Profile2.10Bit.PQ.720p60-20.4.29.1] |
ASSUMPTION_FAILURE
|
org.junit.AssumptionViolatedException: Test not enforced
|
| com.google.android.apps.yts.tvts.YtsReport#yts[FormatSupportTestsVP9LivePartialSegmentPlayback-20.3.2.1] |
ASSUMPTION_FAILURE
|
org.junit.AssumptionViolatedException: Test not enforced
|
| com.google.android.apps.yts.tvts.YtsReport#yts[FormatSupportTestsVP9LivePlayback-20.3.1.1] |
ASSUMPTION_FAILURE
|
org.junit.AssumptionViolatedException: Test not enforced
|
| com.google.android.apps.yts.tvts.YtsReport#yts[FormatSupportTestsVideo/AudioMP4+AC3-20.2.5.1] |
ASSUMPTION_FAILURE
|
org.junit.AssumptionViolatedException: Test not enforced
|
| com.google.android.apps.yts.tvts.YtsReport#yts[FormatSupportTestsVideo/AudioMP4+AV1(Level4.18-bitBT.709Long-FormCodec)-20.2.16.1] |
ASSUMPTION_FAILURE
|
org.junit.AssumptionViolatedException: Test not enforced
|
| com.google.android.apps.yts.tvts.YtsReport#yts[FormatSupportTestsVideo/AudioMP4+AV1(Level4.18-bitBT.709Short-FormCodec)-20.2.7.1] |
ASSUMPTION_FAILURE
|
org.junit.AssumptionViolatedException: Test not enforced
|
| com.google.android.apps.yts.tvts.YtsReport#yts[FormatSupportTestsVideo/AudioMP4+AV1(Level5.110-bitHLG)-20.2.12.1] |
ASSUMPTION_FAILURE
|
org.junit.AssumptionViolatedException: Test not enforced
|
| com.google.android.apps.yts.tvts.YtsReport#yts[FormatSupportTestsVideo/AudioMP4+AV1(Level5.110-bitPQ)-20.2.13.1] |
ASSUMPTION_FAILURE
|
org.junit.AssumptionViolatedException: Test not enforced
|
| com.google.android.apps.yts.tvts.YtsReport#yts[FormatSupportTestsVideo/AudioMP4+AV1(Level5.18-bitBT.709Long-FormCodec)-20.2.17.1] |
ASSUMPTION_FAILURE
|
org.junit.AssumptionViolatedException: Test not enforced
|
| com.google.android.apps.yts.tvts.YtsReport#yts[FormatSupportTestsVideo/AudioMP4+AV1(Level5.18-bitBT.709Short-FormCodec)-20.2.8.1] |
ASSUMPTION_FAILURE
|
org.junit.AssumptionViolatedException: Test not enforced
|
| com.google.android.apps.yts.tvts.YtsReport#yts[FormatSupportTestsVideo/AudioMP4+AV1(Level6.010-bitHLG)-20.2.14.1] |
ASSUMPTION_FAILURE
|
org.junit.AssumptionViolatedException: Test not enforced
|
| com.google.android.apps.yts.tvts.YtsReport#yts[FormatSupportTestsVideo/AudioMP4+AV1(Level6.010-bitPQ)-20.2.15.1] |
ASSUMPTION_FAILURE
|
org.junit.AssumptionViolatedException: Test not enforced
|
| com.google.android.apps.yts.tvts.YtsReport#yts[FormatSupportTestsVideo/AudioMP4+AV1(Level6.08-bitBT.709Long-FormCodec)-20.2.19.1] |
ASSUMPTION_FAILURE
|
org.junit.AssumptionViolatedException: Test not enforced
|
| com.google.android.apps.yts.tvts.YtsReport#yts[FormatSupportTestsVideo/AudioMP4+AV1(Level6.08-bitBT.709Short-FormCodec)-20.2.10.1] |
ASSUMPTION_FAILURE
|
org.junit.AssumptionViolatedException: Test not enforced
|
| com.google.android.apps.yts.tvts.YtsReport#yts[FormatSupportTestsVideo/AudioMP4+EAC3-20.2.6.1] |
ASSUMPTION_FAILURE
|
org.junit.AssumptionViolatedException: Test not enforced
|
| com.google.android.apps.yts.tvts.YtsReport#yts[FormatSupportTestsVideo/AudioMP4+H.264-20.2.1.1] |
ASSUMPTION_FAILURE
|
org.junit.AssumptionViolatedException: Test not enforced
|
| com.google.android.apps.yts.tvts.YtsReport#yts[FormatSupportTestsVideo/AudioWebM+Opus-20.2.4.1] |
ASSUMPTION_FAILURE
|
org.junit.AssumptionViolatedException: Test not enforced
|
| com.google.android.apps.yts.tvts.YtsReport#yts[FormatSupportTestsVideo/AudioWebM+VP9Long-Form-20.2.25.1] |
ASSUMPTION_FAILURE
|
org.junit.AssumptionViolatedException: Test not enforced
|
| com.google.android.apps.yts.tvts.YtsReport#yts[FormatSupportTestsVideo/AudioWebM+VP9Medium-Form-20.2.24.1] |
ASSUMPTION_FAILURE
|
org.junit.AssumptionViolatedException: Test not enforced
|
| com.google.android.apps.yts.tvts.YtsReport#yts[FormatSupportTestsVideo/AudioWebM+VP9Profile2HLGLong-Form-20.2.21.1] |
ASSUMPTION_FAILURE
|
org.junit.AssumptionViolatedException: Test not enforced
|
| com.google.android.apps.yts.tvts.YtsReport#yts[FormatSupportTestsVideo/AudioWebM+VP9Profile2HLGMedium-Form-20.2.3.2] |
ASSUMPTION_FAILURE
|
org.junit.AssumptionViolatedException: Test not enforced
|
| com.google.android.apps.yts.tvts.YtsReport#yts[FormatSupportTestsVideo/AudioWebM+VP9Profile2PQLong-Form-20.2.23.1] |
ASSUMPTION_FAILURE
|
org.junit.AssumptionViolatedException: Test not enforced
|
| com.google.android.apps.yts.tvts.YtsReport#yts[FormatSupportTestsVideo/AudioWebM+VP9Profile2PQMedium-Form-20.2.22.1] |
ASSUMPTION_FAILURE
|
org.junit.AssumptionViolatedException: Test not enforced
|
| com.google.android.apps.yts.tvts.YtsReport#yts[FormatSupportTestsVideo/AudioWebM+VP9Short-Form-20.2.2.2] |
ASSUMPTION_FAILURE
|
org.junit.AssumptionViolatedException: Test not enforced
|
| com.google.android.apps.yts.tvts.YtsReport#yts[FunctionalTestsAssortedECMA262-5StrictMode-14.9.2.1] |
ASSUMPTION_FAILURE
|
org.junit.AssumptionViolatedException: Test not enforced
|
| com.google.android.apps.yts.tvts.YtsReport#yts[FunctionalTestsAssortedJPG-14.9.5.1] |
ASSUMPTION_FAILURE
|
org.junit.AssumptionViolatedException: Test not enforced
|
| com.google.android.apps.yts.tvts.YtsReport#yts[FunctionalTestsAssortedJavaScriptDateObject-14.9.4.1] |
ASSUMPTION_FAILURE
|
org.junit.AssumptionViolatedException: Test not enforced
|
| com.google.android.apps.yts.tvts.YtsReport#yts[FunctionalTestsAssortedMediaRecorderAPI-BFAB8332-5B9B-45C7-80A0-2A54B33EA3A5] |
ASSUMPTION_FAILURE
|
org.junit.AssumptionViolatedException: Test not enforced
|
| com.google.android.apps.yts.tvts.YtsReport#yts[FunctionalTestsAssortedPNG-14.9.6.1] |
ASSUMPTION_FAILURE
|
org.junit.AssumptionViolatedException: Test not enforced
|
| com.google.android.apps.yts.tvts.YtsReport#yts[FunctionalTestsAssortedRequestAnimationFrame-14.9.3.1] |
ASSUMPTION_FAILURE
|
org.junit.AssumptionViolatedException: Test not enforced
|
| com.google.android.apps.yts.tvts.YtsReport#yts[FunctionalTestsAssortedSame-originPolicy-14.20.1.1] |
ASSUMPTION_FAILURE
|
org.junit.AssumptionViolatedException: Test not enforced
|
| com.google.android.apps.yts.tvts.YtsReport#yts[FunctionalTestsAssortedStreamsAPI-ReadableByteStream-14.9.1.1] |
ASSUMPTION_FAILURE
|
org.junit.AssumptionViolatedException: Test not enforced
|
| com.google.android.apps.yts.tvts.YtsReport#yts[FunctionalTestsAssortedWindowSize-14.9.7.1] |
ASSUMPTION_FAILURE
|
org.junit.AssumptionViolatedException: Test not enforced
|
| com.google.android.apps.yts.tvts.YtsReport#yts[FunctionalTestsAudioBufferSourceNodeAudioBufferSourceNode-14.2.1.1] |
ASSUMPTION_FAILURE
|
org.junit.AssumptionViolatedException: Test not enforced
|
| com.google.android.apps.yts.tvts.YtsReport#yts[FunctionalTestsAudioBufferSourceNodeAudioBufferSourceNode.buffer-14.2.2.1] |
ASSUMPTION_FAILURE
|
org.junit.AssumptionViolatedException: Test not enforced
|
| com.google.android.apps.yts.tvts.YtsReport#yts[FunctionalTestsAudioBufferSourceNodeAudioBufferSourceNode.onended-14.2.3.1] |
ASSUMPTION_FAILURE
|
org.junit.AssumptionViolatedException: Test not enforced
|
| com.google.android.apps.yts.tvts.YtsReport#yts[FunctionalTestsAudioBufferSourceNodeAudioBufferSourceNode.start-14.2.5.1] |
ASSUMPTION_FAILURE
|
org.junit.AssumptionViolatedException: Test not enforced
|
| com.google.android.apps.yts.tvts.YtsReport#yts[FunctionalTestsAudioBufferSourceNodeAudioBufferSourceNode.stop-14.2.6.1] |
ASSUMPTION_FAILURE
|
org.junit.AssumptionViolatedException: Test not enforced
|
| com.google.android.apps.yts.tvts.YtsReport#yts[FunctionalTestsAudioContextAudioContext-14.1.1.1] |
ASSUMPTION_FAILURE
|
org.junit.AssumptionViolatedException: Test not enforced
|
| com.google.android.apps.yts.tvts.YtsReport#yts[FunctionalTestsAudioContextAudioContext.createBufferSource-14.1.6.1] |
ASSUMPTION_FAILURE
|
org.junit.AssumptionViolatedException: Test not enforced
|
| com.google.android.apps.yts.tvts.YtsReport#yts[FunctionalTestsAudioContextAudioContext.currentTime-14.1.4.1] |
ASSUMPTION_FAILURE
|
org.junit.AssumptionViolatedException: Test not enforced
|
| com.google.android.apps.yts.tvts.YtsReport#yts[FunctionalTestsAudioContextAudioContext.decodeAudioData-14.1.5.1] |
ASSUMPTION_FAILURE
|
org.junit.AssumptionViolatedException: Test not enforced
|
| com.google.android.apps.yts.tvts.YtsReport#yts[FunctionalTestsAudioContextAudioContext.sampleRate-14.1.3.1] |
ASSUMPTION_FAILURE
|
org.junit.AssumptionViolatedException: Test not enforced
|
| com.google.android.apps.yts.tvts.YtsReport#yts[FunctionalTestsAudioNodeAudioNode-14.3.1.1] |
ASSUMPTION_FAILURE
|
org.junit.AssumptionViolatedException: Test not enforced
|
| com.google.android.apps.yts.tvts.YtsReport#yts[FunctionalTestsAudioNodeAudioNode.channelCountMode-14.3.5.1] |
ASSUMPTION_FAILURE
|
org.junit.AssumptionViolatedException: Test not enforced
|
| com.google.android.apps.yts.tvts.YtsReport#yts[FunctionalTestsAudioNodeAudioNode.channelInterpretation-14.3.6.1] |
ASSUMPTION_FAILURE
|
org.junit.AssumptionViolatedException: Test not enforced
|
| com.google.android.apps.yts.tvts.YtsReport#yts[FunctionalTestsAudioNodeAudioNode.connect-14.3.7.1] |
ASSUMPTION_FAILURE
|
org.junit.AssumptionViolatedException: Test not enforced
|
| com.google.android.apps.yts.tvts.YtsReport#yts[FunctionalTestsAudioNodeAudioNode.context-14.3.2.1] |
ASSUMPTION_FAILURE
|
org.junit.AssumptionViolatedException: Test not enforced
|
| com.google.android.apps.yts.tvts.YtsReport#yts[FunctionalTestsAudioNodeAudioNode.disconnect-14.3.8.1] |
ASSUMPTION_FAILURE
|
org.junit.AssumptionViolatedException: Test not enforced
|
| com.google.android.apps.yts.tvts.YtsReport#yts[FunctionalTestsAudioNodeAudioNode.numberOfInputs-14.3.3.1] |
ASSUMPTION_FAILURE
|
org.junit.AssumptionViolatedException: Test not enforced
|
| com.google.android.apps.yts.tvts.YtsReport#yts[FunctionalTestsAudioNodeAudioNode.numberOfOutputs-14.3.4.1] |
ASSUMPTION_FAILURE
|
org.junit.AssumptionViolatedException: Test not enforced
|
| com.google.android.apps.yts.tvts.YtsReport#yts[FunctionalTestsBufferSourceBufferSize-14.19.1.1] |
ASSUMPTION_FAILURE
|
org.junit.AssumptionViolatedException: Test not enforced
|
| com.google.android.apps.yts.tvts.YtsReport#yts[FunctionalTestsCookieMaxCookieStorage-14.22.4.1] |
ASSUMPTION_FAILURE
|
org.junit.AssumptionViolatedException: Test not enforced
|
| com.google.android.apps.yts.tvts.YtsReport#yts[FunctionalTestsCookieMinCookieStorage-14.22.3.1] |
ASSUMPTION_FAILURE
|
org.junit.AssumptionViolatedException: Test not enforced
|
| com.google.android.apps.yts.tvts.YtsReport#yts[FunctionalTestsCookieSetCookie-14.22.1.1] |
ASSUMPTION_FAILURE
|
org.junit.AssumptionViolatedException: Test not enforced
|
| com.google.android.apps.yts.tvts.YtsReport#yts[FunctionalTestsCookieSetExpiredCookie-14.22.2.1] |
ASSUMPTION_FAILURE
|
org.junit.AssumptionViolatedException: Test not enforced
|
| com.google.android.apps.yts.tvts.YtsReport#yts[FunctionalTestsEMEBasicDRM-14.15.4.2] |
ASSUMPTION_FAILURE
|
org.junit.AssumptionViolatedException: Test not enforced
|
| com.google.android.apps.yts.tvts.YtsReport#yts[FunctionalTestsEMEBasicPlayReady-14.15.3.1] |
ASSUMPTION_FAILURE
|
org.junit.AssumptionViolatedException: Test not enforced
|
| com.google.android.apps.yts.tvts.YtsReport#yts[FunctionalTestsEMEBasicWidevine-14.15.2.2] |
ASSUMPTION_FAILURE
|
org.junit.AssumptionViolatedException: Test not enforced
|
| com.google.android.apps.yts.tvts.YtsReport#yts[FunctionalTestsEMEBasiccanPlayType.keySystem-14.15.1.2] |
ASSUMPTION_FAILURE
|
org.junit.AssumptionViolatedException: Test not enforced
|
| com.google.android.apps.yts.tvts.YtsReport#yts[FunctionalTestsEMEBasicgetMetrics-14.15.6.1] |
ASSUMPTION_FAILURE
|
org.junit.AssumptionViolatedException: Test not enforced
|
| com.google.android.apps.yts.tvts.YtsReport#yts[FunctionalTestsEnumerateDevicesEnumerateDevices-14.16.1.1] |
ASSUMPTION_FAILURE
|
org.junit.AssumptionViolatedException: Test not enforced
|
| com.google.android.apps.yts.tvts.YtsReport#yts[FunctionalTestsFetchAPIFetchAPI-Headers-14.8.2.1] |
ASSUMPTION_FAILURE
|
org.junit.AssumptionViolatedException: Test not enforced
|
| com.google.android.apps.yts.tvts.YtsReport#yts[FunctionalTestsFetchAPIFetchAPI-Request-14.8.3.1] |
ASSUMPTION_FAILURE
|
org.junit.AssumptionViolatedException: Test not enforced
|
| com.google.android.apps.yts.tvts.YtsReport#yts[FunctionalTestsFetchAPIFetchAPI-Response-14.8.4.1] |
ASSUMPTION_FAILURE
|
org.junit.AssumptionViolatedException: Test not enforced
|
| com.google.android.apps.yts.tvts.YtsReport#yts[FunctionalTestsFetchAPIFetchAPI-fetch()-14.8.1.1] |
ASSUMPTION_FAILURE
|
org.junit.AssumptionViolatedException: Test not enforced
|
| com.google.android.apps.yts.tvts.YtsReport#yts[FunctionalTestsFetchAPIFetchAPI-stream-14.8.5.1] |
ASSUMPTION_FAILURE
|
org.junit.AssumptionViolatedException: Test not enforced
|
| com.google.android.apps.yts.tvts.YtsReport#yts[FunctionalTestsFontsFonts-woff-14.21.1.1] |
ASSUMPTION_FAILURE
|
org.junit.AssumptionViolatedException: Test not enforced
|
| com.google.android.apps.yts.tvts.YtsReport#yts[FunctionalTestsFontsFonts-woff2-14.21.2.1] |
ASSUMPTION_FAILURE
|
org.junit.AssumptionViolatedException: Test not enforced
|
| com.google.android.apps.yts.tvts.YtsReport#yts[FunctionalTestsHTTPHTTPS-14.7.1.1] |
ASSUMPTION_FAILURE
|
org.junit.AssumptionViolatedException: Test not enforced
|
| com.google.android.apps.yts.tvts.YtsReport#yts[FunctionalTestsHTTPXMLHTTPRequest-14.7.2.1] |
ASSUMPTION_FAILURE
|
org.junit.AssumptionViolatedException: Test not enforced
|
| com.google.android.apps.yts.tvts.YtsReport#yts[FunctionalTestsHTTPXMLHTTPRequestLevel2-14.7.3.1] |
ASSUMPTION_FAILURE
|
org.junit.AssumptionViolatedException: Test not enforced
|
| com.google.android.apps.yts.tvts.YtsReport#yts[FunctionalTestsMediaSourceMediaSource.activeSourceBuffers-14.13.3.1] |
ASSUMPTION_FAILURE
|
org.junit.AssumptionViolatedException: Test not enforced
|
| com.google.android.apps.yts.tvts.YtsReport#yts[FunctionalTestsMediaSourceMediaSource.addSourceBuffer-14.13.1.1] |
ASSUMPTION_FAILURE
|
org.junit.AssumptionViolatedException: Test not enforced
|
| com.google.android.apps.yts.tvts.YtsReport#yts[FunctionalTestsMediaSourceMediaSource.duration-14.13.4.1] |
ASSUMPTION_FAILURE
|
org.junit.AssumptionViolatedException: Test not enforced
|
| com.google.android.apps.yts.tvts.YtsReport#yts[FunctionalTestsMediaSourceMediaSource.endOfStream-14.13.7.1] |
ASSUMPTION_FAILURE
|
org.junit.AssumptionViolatedException: Test not enforced
|
| com.google.android.apps.yts.tvts.YtsReport#yts[FunctionalTestsMediaSourceMediaSource.readyState-14.13.6.1] |
ASSUMPTION_FAILURE
|
org.junit.AssumptionViolatedException: Test not enforced
|
| com.google.android.apps.yts.tvts.YtsReport#yts[FunctionalTestsMediaSourceMediaSource.removeSourceBuffer-14.13.5.1] |
ASSUMPTION_FAILURE
|
org.junit.AssumptionViolatedException: Test not enforced
|
| com.google.android.apps.yts.tvts.YtsReport#yts[FunctionalTestsMediaSourceMediaSource.sourceBuffers-14.13.2.1] |
ASSUMPTION_FAILURE
|
org.junit.AssumptionViolatedException: Test not enforced
|
| com.google.android.apps.yts.tvts.YtsReport#yts[FunctionalTestsMemoryAllocationCPUSystemMemory-14.18.1.1] |
ASSUMPTION_FAILURE
|
org.junit.AssumptionViolatedException: Test not enforced
|
| com.google.android.apps.yts.tvts.YtsReport#yts[FunctionalTestsMemoryAllocationJavaScriptMemoryAllocation-14.18.2.1] |
ASSUMPTION_FAILURE
|
org.junit.AssumptionViolatedException: Test not enforced
|
| com.google.android.apps.yts.tvts.YtsReport#yts[FunctionalTestsOn-screenKeyboardNokeyboard-14.24.1.1] |
ASSUMPTION_FAILURE
|
org.junit.AssumptionViolatedException: Test not enforced
|
| com.google.android.apps.yts.tvts.YtsReport#yts[FunctionalTestsSSLGlobalSignRootCAR2-14.23.5.1] |
ASSUMPTION_FAILURE
|
org.junit.AssumptionViolatedException: Test not enforced
|
| com.google.android.apps.yts.tvts.YtsReport#yts[FunctionalTestsSSLGlobalSignRootCAR3-14.23.6.1] |
ASSUMPTION_FAILURE
|
org.junit.AssumptionViolatedException: Test not enforced
|
| com.google.android.apps.yts.tvts.YtsReport#yts[FunctionalTestsSSLSelf-Signed-14.23.1.1] |
ASSUMPTION_FAILURE
|
org.junit.AssumptionViolatedException: Test not enforced
|
| com.google.android.apps.yts.tvts.YtsReport#yts[FunctionalTestsSSLTLS-14.23.4.1] |
ASSUMPTION_FAILURE
|
org.junit.AssumptionViolatedException: Test not enforced
|
| com.google.android.apps.yts.tvts.YtsReport#yts[FunctionalTestsSSLexpired-14.23.2.1] |
ASSUMPTION_FAILURE
|
org.junit.AssumptionViolatedException: Test not enforced
|
| com.google.android.apps.yts.tvts.YtsReport#yts[FunctionalTestsSSLsha256-14.23.3.1] |
ASSUMPTION_FAILURE
|
org.junit.AssumptionViolatedException: Test not enforced
|
| com.google.android.apps.yts.tvts.YtsReport#yts[FunctionalTestsSecurityCORS-14.5.1.1] |
ASSUMPTION_FAILURE
|
org.junit.AssumptionViolatedException: Test not enforced
|
| com.google.android.apps.yts.tvts.YtsReport#yts[FunctionalTestsURLLengthImageSrcURLLength-14.4.2.1] |
ASSUMPTION_FAILURE
|
org.junit.AssumptionViolatedException: Test not enforced
|
| com.google.android.apps.yts.tvts.YtsReport#yts[FunctionalTestsURLLengthVideoSrcURLLength-mp4-14.4.3.1] |
ASSUMPTION_FAILURE
|
org.junit.AssumptionViolatedException: Test not enforced
|
| com.google.android.apps.yts.tvts.YtsReport#yts[FunctionalTestsURLLengthXHRURLLength-14.4.4.1] |
ASSUMPTION_FAILURE
|
org.junit.AssumptionViolatedException: Test not enforced
|
| com.google.android.apps.yts.tvts.YtsReport#yts[FunctionalTestsUserAgentStarboardUserAgent-14.17.3.3] |
ASSUMPTION_FAILURE
|
org.junit.AssumptionViolatedException: Test not enforced
|
| com.google.android.apps.yts.tvts.YtsReport#yts[FunctionalTestsUserAgentglesinUserAgent-14.17.5.3] |
ASSUMPTION_FAILURE
|
org.junit.AssumptionViolatedException: Test not enforced
|
| com.google.android.apps.yts.tvts.YtsReport#yts[FunctionalTestsWebPWebP-14.10.1.1] |
ASSUMPTION_FAILURE
|
org.junit.AssumptionViolatedException: Test not enforced
|
| com.google.android.apps.yts.tvts.YtsReport#yts[FunctionalTestsWebPWebPAlpha-14.10.2.1] |
ASSUMPTION_FAILURE
|
org.junit.AssumptionViolatedException: Test not enforced
|
| com.google.android.apps.yts.tvts.YtsReport#yts[FunctionalTestsWebPWebPAnimation-14.10.3.1] |
ASSUMPTION_FAILURE
|
org.junit.AssumptionViolatedException: Test not enforced
|
| com.google.android.apps.yts.tvts.YtsReport#yts[FunctionalTestsWebPWebPLossless-14.10.4.1] |
ASSUMPTION_FAILURE
|
org.junit.AssumptionViolatedException: Test not enforced
|
| com.google.android.apps.yts.tvts.YtsReport#yts[FunctionalTestslocalStoragelocalStorage-14.6.1.1] |
ASSUMPTION_FAILURE
|
org.junit.AssumptionViolatedException: Test not enforced
|
| com.google.android.apps.yts.tvts.YtsReport#yts[FunctionalTestslocalStoragelocalStorage.getItem-14.6.3.1] |
ASSUMPTION_FAILURE
|
org.junit.AssumptionViolatedException: Test not enforced
|
| com.google.android.apps.yts.tvts.YtsReport#yts[FunctionalTestslocalStoragelocalStorage.removeItem-14.6.4.1] |
ASSUMPTION_FAILURE
|
org.junit.AssumptionViolatedException: Test not enforced
|
| com.google.android.apps.yts.tvts.YtsReport#yts[FunctionalTestslocalStoragelocalStorage.setItem-14.6.2.1] |
ASSUMPTION_FAILURE
|
org.junit.AssumptionViolatedException: Test not enforced
|
| com.google.android.apps.yts.tvts.YtsReport#yts[H264SFRTestsH264SFRPlaybackPerformancePlaybackPerfH264.1080p.30fps@0.25X-8.2.13.1] |
ASSUMPTION_FAILURE
|
org.junit.AssumptionViolatedException: Test not enforced
|
| com.google.android.apps.yts.tvts.YtsReport#yts[H264SFRTestsH264SFRPlaybackPerformancePlaybackPerfH264.1080p.30fps@0.5X-8.2.14.1] |
ASSUMPTION_FAILURE
|
org.junit.AssumptionViolatedException: Test not enforced
|
| com.google.android.apps.yts.tvts.YtsReport#yts[H264SFRTestsH264SFRPlaybackPerformancePlaybackPerfH264.1080p.30fps@0.75X-8.2.15.1] |
ASSUMPTION_FAILURE
|
org.junit.AssumptionViolatedException: Test not enforced
|
| com.google.android.apps.yts.tvts.YtsReport#yts[H264SFRTestsH264SFRPlaybackPerformancePlaybackPerfH264.1080p.30fps@1.25X-8.2.17.1] |
ASSUMPTION_FAILURE
|
org.junit.AssumptionViolatedException: Test not enforced
|
| com.google.android.apps.yts.tvts.YtsReport#yts[H264SFRTestsH264SFRPlaybackPerformancePlaybackPerfH264.1080p.30fps@1.5X-8.2.18.1] |
ASSUMPTION_FAILURE
|
org.junit.AssumptionViolatedException: Test not enforced
|
| com.google.android.apps.yts.tvts.YtsReport#yts[H264SFRTestsH264SFRPlaybackPerformancePlaybackPerfH264.1080p.30fps@1.75X-8.2.19.1] |
ASSUMPTION_FAILURE
|
org.junit.AssumptionViolatedException: Test not enforced
|
| com.google.android.apps.yts.tvts.YtsReport#yts[H264SFRTestsH264SFRPlaybackPerformancePlaybackPerfH264.1080p.30fps@1X-8.2.16.1] |
ASSUMPTION_FAILURE
|
org.junit.AssumptionViolatedException: Test not enforced
|
| com.google.android.apps.yts.tvts.YtsReport#yts[H264SFRTestsH264SFRPlaybackPerformancePlaybackPerfH264.1080p.30fps@2X-8.2.20.1] |
ASSUMPTION_FAILURE
|
org.junit.AssumptionViolatedException: Test not enforced
|
| com.google.android.apps.yts.tvts.YtsReport#yts[H264SFRTestsH264SFRPlaybackPerformancePlaybackPerfH264.1440p.30fps@0.25X-8.2.21.1] |
ASSUMPTION_FAILURE
|
org.junit.AssumptionViolatedException: Test not enforced
|
| com.google.android.apps.yts.tvts.YtsReport#yts[H264SFRTestsH264SFRPlaybackPerformancePlaybackPerfH264.1440p.30fps@0.5X-8.2.22.1] |
ASSUMPTION_FAILURE
|
org.junit.AssumptionViolatedException: Test not enforced
|
| com.google.android.apps.yts.tvts.YtsReport#yts[H264SFRTestsH264SFRPlaybackPerformancePlaybackPerfH264.1440p.30fps@0.75X-8.2.23.1] |
ASSUMPTION_FAILURE
|
org.junit.AssumptionViolatedException: Test not enforced
|
| com.google.android.apps.yts.tvts.YtsReport#yts[H264SFRTestsH264SFRPlaybackPerformancePlaybackPerfH264.1440p.30fps@1.25X-8.2.25.1] |
ASSUMPTION_FAILURE
|
org.junit.AssumptionViolatedException: Test not enforced
|
| com.google.android.apps.yts.tvts.YtsReport#yts[H264SFRTestsH264SFRPlaybackPerformancePlaybackPerfH264.1440p.30fps@1.5X-8.2.26.1] |
ASSUMPTION_FAILURE
|
org.junit.AssumptionViolatedException: Test not enforced
|
| com.google.android.apps.yts.tvts.YtsReport#yts[H264SFRTestsH264SFRPlaybackPerformancePlaybackPerfH264.1440p.30fps@1.75X-8.2.27.1] |
ASSUMPTION_FAILURE
|
org.junit.AssumptionViolatedException: Test not enforced
|
| com.google.android.apps.yts.tvts.YtsReport#yts[H264SFRTestsH264SFRPlaybackPerformancePlaybackPerfH264.1440p.30fps@1X-8.2.24.1] |
ASSUMPTION_FAILURE
|
org.junit.AssumptionViolatedException: Test not enforced
|
| com.google.android.apps.yts.tvts.YtsReport#yts[H264SFRTestsH264SFRPlaybackPerformancePlaybackPerfH264.1440p.30fps@2X-8.2.28.1] |
ASSUMPTION_FAILURE
|
org.junit.AssumptionViolatedException: Test not enforced
|
| com.google.android.apps.yts.tvts.YtsReport#yts[H264SFRTestsH264SFRPlaybackPerformancePlaybackPerfH264.144p.15fps@1X-8.2.1.1] |
ASSUMPTION_FAILURE
|
org.junit.AssumptionViolatedException: Test not enforced
|
| com.google.android.apps.yts.tvts.YtsReport#yts[H264SFRTestsH264SFRPlaybackPerformancePlaybackPerfH264.2160p.30fps@0.25X-8.2.29.1] |
ASSUMPTION_FAILURE
|
org.junit.AssumptionViolatedException: Test not enforced
|
| com.google.android.apps.yts.tvts.YtsReport#yts[H264SFRTestsH264SFRPlaybackPerformancePlaybackPerfH264.2160p.30fps@0.5X-8.2.30.1] |
ASSUMPTION_FAILURE
|
org.junit.AssumptionViolatedException: Test not enforced
|
| com.google.android.apps.yts.tvts.YtsReport#yts[H264SFRTestsH264SFRPlaybackPerformancePlaybackPerfH264.2160p.30fps@0.75X-8.2.31.1] |
ASSUMPTION_FAILURE
|
org.junit.AssumptionViolatedException: Test not enforced
|
| com.google.android.apps.yts.tvts.YtsReport#yts[H264SFRTestsH264SFRPlaybackPerformancePlaybackPerfH264.2160p.30fps@1.25X-8.2.33.1] |
ASSUMPTION_FAILURE
|
org.junit.AssumptionViolatedException: Test not enforced
|
| com.google.android.apps.yts.tvts.YtsReport#yts[H264SFRTestsH264SFRPlaybackPerformancePlaybackPerfH264.2160p.30fps@1X-8.2.32.1] |
ASSUMPTION_FAILURE
|
org.junit.AssumptionViolatedException: Test not enforced
|
| com.google.android.apps.yts.tvts.YtsReport#yts[H264SFRTestsH264SFRPlaybackPerformancePlaybackPerfH264.240p.30fps@1X-8.2.2.1] |
ASSUMPTION_FAILURE
|
org.junit.AssumptionViolatedException: Test not enforced
|
| com.google.android.apps.yts.tvts.YtsReport#yts[H264SFRTestsH264SFRPlaybackPerformancePlaybackPerfH264.360p.30fps@1X-8.2.3.1] |
ASSUMPTION_FAILURE
|
org.junit.AssumptionViolatedException: Test not enforced
|
| com.google.android.apps.yts.tvts.YtsReport#yts[H264SFRTestsH264SFRPlaybackPerformancePlaybackPerfH264.480p.30fps@1X-8.2.4.1] |
ASSUMPTION_FAILURE
|
org.junit.AssumptionViolatedException: Test not enforced
|
| com.google.android.apps.yts.tvts.YtsReport#yts[H264SFRTestsH264SFRPlaybackPerformancePlaybackPerfH264.720p.30fps@0.25X-8.2.5.1] |
ASSUMPTION_FAILURE
|
org.junit.AssumptionViolatedException: Test not enforced
|
| com.google.android.apps.yts.tvts.YtsReport#yts[H264SFRTestsH264SFRPlaybackPerformancePlaybackPerfH264.720p.30fps@0.5X-8.2.6.1] |
ASSUMPTION_FAILURE
|
org.junit.AssumptionViolatedException: Test not enforced
|
| com.google.android.apps.yts.tvts.YtsReport#yts[H264SFRTestsH264SFRPlaybackPerformancePlaybackPerfH264.720p.30fps@0.75X-8.2.7.1] |
ASSUMPTION_FAILURE
|
org.junit.AssumptionViolatedException: Test not enforced
|
| com.google.android.apps.yts.tvts.YtsReport#yts[H264SFRTestsH264SFRPlaybackPerformancePlaybackPerfH264.720p.30fps@1.25X-8.2.9.1] |
ASSUMPTION_FAILURE
|
org.junit.AssumptionViolatedException: Test not enforced
|
| com.google.android.apps.yts.tvts.YtsReport#yts[H264SFRTestsH264SFRPlaybackPerformancePlaybackPerfH264.720p.30fps@1.5X-8.2.10.1] |
ASSUMPTION_FAILURE
|
org.junit.AssumptionViolatedException: Test not enforced
|
| com.google.android.apps.yts.tvts.YtsReport#yts[H264SFRTestsH264SFRPlaybackPerformancePlaybackPerfH264.720p.30fps@1.75X-8.2.11.1] |
ASSUMPTION_FAILURE
|
org.junit.AssumptionViolatedException: Test not enforced
|
| com.google.android.apps.yts.tvts.YtsReport#yts[H264SFRTestsH264SFRPlaybackPerformancePlaybackPerfH264.720p.30fps@1X-8.2.8.1] |
ASSUMPTION_FAILURE
|
org.junit.AssumptionViolatedException: Test not enforced
|
| com.google.android.apps.yts.tvts.YtsReport#yts[H264SFRTestsH264SFRPlaybackPerformancePlaybackPerfH264.720p.30fps@2X-8.2.12.1] |
ASSUMPTION_FAILURE
|
org.junit.AssumptionViolatedException: Test not enforced
|
| com.google.android.apps.yts.tvts.YtsReport#yts[H264SFRTestsMediaPlaybackQualityFrameDrop-8.1.2.1] |
ASSUMPTION_FAILURE
|
org.junit.AssumptionViolatedException: Test not enforced
|
| com.google.android.apps.yts.tvts.YtsReport#yts[H264SFRTestsMediaPlaybackQualityTotalVideoFrames-8.1.1.1] |
ASSUMPTION_FAILURE
|
org.junit.AssumptionViolatedException: Test not enforced
|
| com.google.android.apps.yts.tvts.YtsReport#yts[H264WidevineSFRTestsH264WidevineSFRPlaybackPerformancePlaybackPerfH264.1080p.30fps@0.25X-12.2.31.1] |
ASSUMPTION_FAILURE
|
org.junit.AssumptionViolatedException: Test not enforced
|
| com.google.android.apps.yts.tvts.YtsReport#yts[H264WidevineSFRTestsH264WidevineSFRPlaybackPerformancePlaybackPerfH264.1080p.30fps@0.5X-12.2.32.1] |
ASSUMPTION_FAILURE
|
org.junit.AssumptionViolatedException: Test not enforced
|
| com.google.android.apps.yts.tvts.YtsReport#yts[H264WidevineSFRTestsH264WidevineSFRPlaybackPerformancePlaybackPerfH264.1080p.30fps@0.75X-12.2.33.1] |
ASSUMPTION_FAILURE
|
org.junit.AssumptionViolatedException: Test not enforced
|
| com.google.android.apps.yts.tvts.YtsReport#yts[H264WidevineSFRTestsH264WidevineSFRPlaybackPerformancePlaybackPerfH264.1080p.30fps@1.25X-12.2.35.1] |
ASSUMPTION_FAILURE
|
org.junit.AssumptionViolatedException: Test not enforced
|
| com.google.android.apps.yts.tvts.YtsReport#yts[H264WidevineSFRTestsH264WidevineSFRPlaybackPerformancePlaybackPerfH264.1080p.30fps@1.5X-12.2.36.1] |
ASSUMPTION_FAILURE
|
org.junit.AssumptionViolatedException: Test not enforced
|
| com.google.android.apps.yts.tvts.YtsReport#yts[H264WidevineSFRTestsH264WidevineSFRPlaybackPerformancePlaybackPerfH264.1080p.30fps@1.75X-12.2.37.1] |
ASSUMPTION_FAILURE
|
org.junit.AssumptionViolatedException: Test not enforced
|
| com.google.android.apps.yts.tvts.YtsReport#yts[H264WidevineSFRTestsH264WidevineSFRPlaybackPerformancePlaybackPerfH264.1080p.30fps@1X-12.2.34.1] |
ASSUMPTION_FAILURE
|
org.junit.AssumptionViolatedException: Test not enforced
|
| com.google.android.apps.yts.tvts.YtsReport#yts[H264WidevineSFRTestsH264WidevineSFRPlaybackPerformancePlaybackPerfH264.1080p.30fps@2X-12.2.38.1] |
ASSUMPTION_FAILURE
|
org.junit.AssumptionViolatedException: Test not enforced
|
| com.google.android.apps.yts.tvts.YtsReport#yts[H264WidevineSFRTestsH264WidevineSFRPlaybackPerformancePlaybackPerfH264.1080p.HQ.30fps@0.25X-12.2.47.1] |
ASSUMPTION_FAILURE
|
org.junit.AssumptionViolatedException: Test not enforced
|
| com.google.android.apps.yts.tvts.YtsReport#yts[H264WidevineSFRTestsH264WidevineSFRPlaybackPerformancePlaybackPerfH264.1080p.HQ.30fps@0.5X-12.2.48.1] |
ASSUMPTION_FAILURE
|
org.junit.AssumptionViolatedException: Test not enforced
|
| com.google.android.apps.yts.tvts.YtsReport#yts[H264WidevineSFRTestsH264WidevineSFRPlaybackPerformancePlaybackPerfH264.1080p.HQ.30fps@0.75X-12.2.49.1] |
ASSUMPTION_FAILURE
|
org.junit.AssumptionViolatedException: Test not enforced
|
| com.google.android.apps.yts.tvts.YtsReport#yts[H264WidevineSFRTestsH264WidevineSFRPlaybackPerformancePlaybackPerfH264.1080p.HQ.30fps@1.25X-12.2.51.1] |
ASSUMPTION_FAILURE
|
org.junit.AssumptionViolatedException: Test not enforced
|
| com.google.android.apps.yts.tvts.YtsReport#yts[H264WidevineSFRTestsH264WidevineSFRPlaybackPerformancePlaybackPerfH264.1080p.HQ.30fps@1.5X-12.2.52.1] |
ASSUMPTION_FAILURE
|
org.junit.AssumptionViolatedException: Test not enforced
|
| com.google.android.apps.yts.tvts.YtsReport#yts[H264WidevineSFRTestsH264WidevineSFRPlaybackPerformancePlaybackPerfH264.1080p.HQ.30fps@1.75X-12.2.53.1] |
ASSUMPTION_FAILURE
|
org.junit.AssumptionViolatedException: Test not enforced
|
| com.google.android.apps.yts.tvts.YtsReport#yts[H264WidevineSFRTestsH264WidevineSFRPlaybackPerformancePlaybackPerfH264.1080p.HQ.30fps@1X-12.2.50.1] |
ASSUMPTION_FAILURE
|
org.junit.AssumptionViolatedException: Test not enforced
|
| com.google.android.apps.yts.tvts.YtsReport#yts[H264WidevineSFRTestsH264WidevineSFRPlaybackPerformancePlaybackPerfH264.1080p.HQ.30fps@2X-12.2.54.1] |
ASSUMPTION_FAILURE
|
org.junit.AssumptionViolatedException: Test not enforced
|
| com.google.android.apps.yts.tvts.YtsReport#yts[H264WidevineSFRTestsH264WidevineSFRPlaybackPerformancePlaybackPerfH264.1080p.MQ.30fps@0.25X-12.2.39.1] |
ASSUMPTION_FAILURE
|
org.junit.AssumptionViolatedException: Test not enforced
|
| com.google.android.apps.yts.tvts.YtsReport#yts[H264WidevineSFRTestsH264WidevineSFRPlaybackPerformancePlaybackPerfH264.1080p.MQ.30fps@0.5X-12.2.40.1] |
ASSUMPTION_FAILURE
|
org.junit.AssumptionViolatedException: Test not enforced
|
| com.google.android.apps.yts.tvts.YtsReport#yts[H264WidevineSFRTestsH264WidevineSFRPlaybackPerformancePlaybackPerfH264.1080p.MQ.30fps@0.75X-12.2.41.1] |
ASSUMPTION_FAILURE
|
org.junit.AssumptionViolatedException: Test not enforced
|
| com.google.android.apps.yts.tvts.YtsReport#yts[H264WidevineSFRTestsH264WidevineSFRPlaybackPerformancePlaybackPerfH264.1080p.MQ.30fps@1.25X-12.2.43.1] |
ASSUMPTION_FAILURE
|
org.junit.AssumptionViolatedException: Test not enforced
|
| com.google.android.apps.yts.tvts.YtsReport#yts[H264WidevineSFRTestsH264WidevineSFRPlaybackPerformancePlaybackPerfH264.1080p.MQ.30fps@1.5X-12.2.44.1] |
ASSUMPTION_FAILURE
|
org.junit.AssumptionViolatedException: Test not enforced
|
| com.google.android.apps.yts.tvts.YtsReport#yts[H264WidevineSFRTestsH264WidevineSFRPlaybackPerformancePlaybackPerfH264.1080p.MQ.30fps@1.75X-12.2.45.1] |
ASSUMPTION_FAILURE
|
org.junit.AssumptionViolatedException: Test not enforced
|
| com.google.android.apps.yts.tvts.YtsReport#yts[H264WidevineSFRTestsH264WidevineSFRPlaybackPerformancePlaybackPerfH264.1080p.MQ.30fps@1X-12.2.42.1] |
ASSUMPTION_FAILURE
|
org.junit.AssumptionViolatedException: Test not enforced
|
| com.google.android.apps.yts.tvts.YtsReport#yts[H264WidevineSFRTestsH264WidevineSFRPlaybackPerformancePlaybackPerfH264.1080p.MQ.30fps@2X-12.2.46.1] |
ASSUMPTION_FAILURE
|
org.junit.AssumptionViolatedException: Test not enforced
|
| com.google.android.apps.yts.tvts.YtsReport#yts[H264WidevineSFRTestsH264WidevineSFRPlaybackPerformancePlaybackPerfH264.144p.30fps@1X-12.2.1.1] |
ASSUMPTION_FAILURE
|
org.junit.AssumptionViolatedException: Test not enforced
|
| com.google.android.apps.yts.tvts.YtsReport#yts[H264WidevineSFRTestsH264WidevineSFRPlaybackPerformancePlaybackPerfH264.240p.30fps@1X-12.2.2.1] |
ASSUMPTION_FAILURE
|
org.junit.AssumptionViolatedException: Test not enforced
|
| com.google.android.apps.yts.tvts.YtsReport#yts[H264WidevineSFRTestsH264WidevineSFRPlaybackPerformancePlaybackPerfH264.360p.30fps@1X-12.2.3.1] |
ASSUMPTION_FAILURE
|
org.junit.AssumptionViolatedException: Test not enforced
|
| com.google.android.apps.yts.tvts.YtsReport#yts[H264WidevineSFRTestsH264WidevineSFRPlaybackPerformancePlaybackPerfH264.480p.30fps@1X-12.2.4.1] |
ASSUMPTION_FAILURE
|
org.junit.AssumptionViolatedException: Test not enforced
|
| com.google.android.apps.yts.tvts.YtsReport#yts[H264WidevineSFRTestsH264WidevineSFRPlaybackPerformancePlaybackPerfH264.480p.HQ.30fps@1X-12.2.6.1] |
ASSUMPTION_FAILURE
|
org.junit.AssumptionViolatedException: Test not enforced
|
| com.google.android.apps.yts.tvts.YtsReport#yts[H264WidevineSFRTestsH264WidevineSFRPlaybackPerformancePlaybackPerfH264.480p.MQ.30fps@1X-12.2.5.1] |
ASSUMPTION_FAILURE
|
org.junit.AssumptionViolatedException: Test not enforced
|
| com.google.android.apps.yts.tvts.YtsReport#yts[H264WidevineSFRTestsH264WidevineSFRPlaybackPerformancePlaybackPerfH264.720p.30fps@0.25X-12.2.7.1] |
ASSUMPTION_FAILURE
|
org.junit.AssumptionViolatedException: Test not enforced
|
| com.google.android.apps.yts.tvts.YtsReport#yts[H264WidevineSFRTestsH264WidevineSFRPlaybackPerformancePlaybackPerfH264.720p.30fps@0.5X-12.2.8.1] |
ASSUMPTION_FAILURE
|
org.junit.AssumptionViolatedException: Test not enforced
|
| com.google.android.apps.yts.tvts.YtsReport#yts[H264WidevineSFRTestsH264WidevineSFRPlaybackPerformancePlaybackPerfH264.720p.30fps@0.75X-12.2.9.1] |
ASSUMPTION_FAILURE
|
org.junit.AssumptionViolatedException: Test not enforced
|
| com.google.android.apps.yts.tvts.YtsReport#yts[H264WidevineSFRTestsH264WidevineSFRPlaybackPerformancePlaybackPerfH264.720p.30fps@1.25X-12.2.11.1] |
ASSUMPTION_FAILURE
|
org.junit.AssumptionViolatedException: Test not enforced
|
| com.google.android.apps.yts.tvts.YtsReport#yts[H264WidevineSFRTestsH264WidevineSFRPlaybackPerformancePlaybackPerfH264.720p.30fps@1.5X-12.2.12.1] |
ASSUMPTION_FAILURE
|
org.junit.AssumptionViolatedException: Test not enforced
|
| com.google.android.apps.yts.tvts.YtsReport#yts[H264WidevineSFRTestsH264WidevineSFRPlaybackPerformancePlaybackPerfH264.720p.30fps@1.75X-12.2.13.1] |
ASSUMPTION_FAILURE
|
org.junit.AssumptionViolatedException: Test not enforced
|
| com.google.android.apps.yts.tvts.YtsReport#yts[H264WidevineSFRTestsH264WidevineSFRPlaybackPerformancePlaybackPerfH264.720p.30fps@1X-12.2.10.1] |
ASSUMPTION_FAILURE
|
org.junit.AssumptionViolatedException: Test not enforced
|
| com.google.android.apps.yts.tvts.YtsReport#yts[H264WidevineSFRTestsH264WidevineSFRPlaybackPerformancePlaybackPerfH264.720p.30fps@2X-12.2.14.1] |
ASSUMPTION_FAILURE
|
org.junit.AssumptionViolatedException: Test not enforced
|
| com.google.android.apps.yts.tvts.YtsReport#yts[H264WidevineSFRTestsH264WidevineSFRPlaybackPerformancePlaybackPerfH264.720p.HQ.30fps@0.25X-12.2.23.1] |
ASSUMPTION_FAILURE
|
org.junit.AssumptionViolatedException: Test not enforced
|
| com.google.android.apps.yts.tvts.YtsReport#yts[H264WidevineSFRTestsH264WidevineSFRPlaybackPerformancePlaybackPerfH264.720p.HQ.30fps@0.5X-12.2.24.1] |
ASSUMPTION_FAILURE
|
org.junit.AssumptionViolatedException: Test not enforced
|
| com.google.android.apps.yts.tvts.YtsReport#yts[H264WidevineSFRTestsH264WidevineSFRPlaybackPerformancePlaybackPerfH264.720p.HQ.30fps@0.75X-12.2.25.1] |
ASSUMPTION_FAILURE
|
org.junit.AssumptionViolatedException: Test not enforced
|
| com.google.android.apps.yts.tvts.YtsReport#yts[H264WidevineSFRTestsH264WidevineSFRPlaybackPerformancePlaybackPerfH264.720p.HQ.30fps@1.25X-12.2.27.1] |
ASSUMPTION_FAILURE
|
org.junit.AssumptionViolatedException: Test not enforced
|
| com.google.android.apps.yts.tvts.YtsReport#yts[H264WidevineSFRTestsH264WidevineSFRPlaybackPerformancePlaybackPerfH264.720p.HQ.30fps@1.5X-12.2.28.1] |
ASSUMPTION_FAILURE
|
org.junit.AssumptionViolatedException: Test not enforced
|
| com.google.android.apps.yts.tvts.YtsReport#yts[H264WidevineSFRTestsH264WidevineSFRPlaybackPerformancePlaybackPerfH264.720p.HQ.30fps@1.75X-12.2.29.1] |
ASSUMPTION_FAILURE
|
org.junit.AssumptionViolatedException: Test not enforced
|
| com.google.android.apps.yts.tvts.YtsReport#yts[H264WidevineSFRTestsH264WidevineSFRPlaybackPerformancePlaybackPerfH264.720p.HQ.30fps@1X-12.2.26.1] |
ASSUMPTION_FAILURE
|
org.junit.AssumptionViolatedException: Test not enforced
|
| com.google.android.apps.yts.tvts.YtsReport#yts[H264WidevineSFRTestsH264WidevineSFRPlaybackPerformancePlaybackPerfH264.720p.HQ.30fps@2X-12.2.30.1] |
ASSUMPTION_FAILURE
|
org.junit.AssumptionViolatedException: Test not enforced
|
| com.google.android.apps.yts.tvts.YtsReport#yts[H264WidevineSFRTestsH264WidevineSFRPlaybackPerformancePlaybackPerfH264.720p.MQ.30fps@0.25X-12.2.15.1] |
ASSUMPTION_FAILURE
|
org.junit.AssumptionViolatedException: Test not enforced
|
| com.google.android.apps.yts.tvts.YtsReport#yts[H264WidevineSFRTestsH264WidevineSFRPlaybackPerformancePlaybackPerfH264.720p.MQ.30fps@0.5X-12.2.16.1] |
ASSUMPTION_FAILURE
|
org.junit.AssumptionViolatedException: Test not enforced
|
| com.google.android.apps.yts.tvts.YtsReport#yts[H264WidevineSFRTestsH264WidevineSFRPlaybackPerformancePlaybackPerfH264.720p.MQ.30fps@0.75X-12.2.17.1] |
ASSUMPTION_FAILURE
|
org.junit.AssumptionViolatedException: Test not enforced
|
| com.google.android.apps.yts.tvts.YtsReport#yts[H264WidevineSFRTestsH264WidevineSFRPlaybackPerformancePlaybackPerfH264.720p.MQ.30fps@1.25X-12.2.19.1] |
ASSUMPTION_FAILURE
|
org.junit.AssumptionViolatedException: Test not enforced
|
| com.google.android.apps.yts.tvts.YtsReport#yts[H264WidevineSFRTestsH264WidevineSFRPlaybackPerformancePlaybackPerfH264.720p.MQ.30fps@1.5X-12.2.20.1] |
ASSUMPTION_FAILURE
|
org.junit.AssumptionViolatedException: Test not enforced
|
| com.google.android.apps.yts.tvts.YtsReport#yts[H264WidevineSFRTestsH264WidevineSFRPlaybackPerformancePlaybackPerfH264.720p.MQ.30fps@1.75X-12.2.21.1] |
ASSUMPTION_FAILURE
|
org.junit.AssumptionViolatedException: Test not enforced
|
| com.google.android.apps.yts.tvts.YtsReport#yts[H264WidevineSFRTestsH264WidevineSFRPlaybackPerformancePlaybackPerfH264.720p.MQ.30fps@1X-12.2.18.1] |
ASSUMPTION_FAILURE
|
org.junit.AssumptionViolatedException: Test not enforced
|
| com.google.android.apps.yts.tvts.YtsReport#yts[H264WidevineSFRTestsH264WidevineSFRPlaybackPerformancePlaybackPerfH264.720p.MQ.30fps@2X-12.2.22.1] |
ASSUMPTION_FAILURE
|
org.junit.AssumptionViolatedException: Test not enforced
|
| com.google.android.apps.yts.tvts.YtsReport#yts[H264WidevineSFRTestsMediaPlaybackQualityFrameDrop-12.1.2.1] |
ASSUMPTION_FAILURE
|
org.junit.AssumptionViolatedException: Test not enforced
|
| com.google.android.apps.yts.tvts.YtsReport#yts[H264WidevineSFRTestsMediaPlaybackQualityTotalVideoFrames-12.1.1.1] |
ASSUMPTION_FAILURE
|
org.junit.AssumptionViolatedException: Test not enforced
|
| com.google.android.apps.yts.tvts.YtsReport#yts[HFRTestsHFRPlaybackPerformancePlaybackPerfAV1.1080p.60fps@0.25X-10.2.57.1] |
ASSUMPTION_FAILURE
|
org.junit.AssumptionViolatedException: Test not enforced
|
| com.google.android.apps.yts.tvts.YtsReport#yts[HFRTestsHFRPlaybackPerformancePlaybackPerfAV1.1080p.60fps@0.5X-10.2.58.1] |
ASSUMPTION_FAILURE
|
org.junit.AssumptionViolatedException: Test not enforced
|
| com.google.android.apps.yts.tvts.YtsReport#yts[HFRTestsHFRPlaybackPerformancePlaybackPerfAV1.1080p.60fps@0.75X-10.2.59.1] |
ASSUMPTION_FAILURE
|
org.junit.AssumptionViolatedException: Test not enforced
|
| com.google.android.apps.yts.tvts.YtsReport#yts[HFRTestsHFRPlaybackPerformancePlaybackPerfAV1.1080p.60fps@1.25X-10.2.61.1] |
ASSUMPTION_FAILURE
|
org.junit.AssumptionViolatedException: Test not enforced
|
| com.google.android.apps.yts.tvts.YtsReport#yts[HFRTestsHFRPlaybackPerformancePlaybackPerfAV1.1080p.60fps@1.5X-10.2.62.1] |
ASSUMPTION_FAILURE
|
org.junit.AssumptionViolatedException: Test not enforced
|
| com.google.android.apps.yts.tvts.YtsReport#yts[HFRTestsHFRPlaybackPerformancePlaybackPerfAV1.1080p.60fps@1.75X-10.2.63.1] |
ASSUMPTION_FAILURE
|
org.junit.AssumptionViolatedException: Test not enforced
|
| com.google.android.apps.yts.tvts.YtsReport#yts[HFRTestsHFRPlaybackPerformancePlaybackPerfAV1.1080p.60fps@1X-10.2.60.1] |
ASSUMPTION_FAILURE
|
org.junit.AssumptionViolatedException: Test not enforced
|
| com.google.android.apps.yts.tvts.YtsReport#yts[HFRTestsHFRPlaybackPerformancePlaybackPerfAV1.1080p.60fps@2X-10.2.64.1] |
ASSUMPTION_FAILURE
|
org.junit.AssumptionViolatedException: Test not enforced
|
| com.google.android.apps.yts.tvts.YtsReport#yts[HFRTestsHFRPlaybackPerformancePlaybackPerfAV1.1440p.60fps@0.25X-10.2.65.1] |
ASSUMPTION_FAILURE
|
org.junit.AssumptionViolatedException: Test not enforced
|
| com.google.android.apps.yts.tvts.YtsReport#yts[HFRTestsHFRPlaybackPerformancePlaybackPerfAV1.1440p.60fps@0.5X-10.2.66.1] |
ASSUMPTION_FAILURE
|
org.junit.AssumptionViolatedException: Test not enforced
|
| com.google.android.apps.yts.tvts.YtsReport#yts[HFRTestsHFRPlaybackPerformancePlaybackPerfAV1.1440p.60fps@0.75X-10.2.67.1] |
ASSUMPTION_FAILURE
|
org.junit.AssumptionViolatedException: Test not enforced
|
| com.google.android.apps.yts.tvts.YtsReport#yts[HFRTestsHFRPlaybackPerformancePlaybackPerfAV1.1440p.60fps@1.25X-10.2.69.1] |
ASSUMPTION_FAILURE
|
org.junit.AssumptionViolatedException: Test not enforced
|
| com.google.android.apps.yts.tvts.YtsReport#yts[HFRTestsHFRPlaybackPerformancePlaybackPerfAV1.1440p.60fps@1.5X-10.2.70.1] |
ASSUMPTION_FAILURE
|
org.junit.AssumptionViolatedException: Test not enforced
|
| com.google.android.apps.yts.tvts.YtsReport#yts[HFRTestsHFRPlaybackPerformancePlaybackPerfAV1.1440p.60fps@1.75X-10.2.71.1] |
ASSUMPTION_FAILURE
|
org.junit.AssumptionViolatedException: Test not enforced
|
| com.google.android.apps.yts.tvts.YtsReport#yts[HFRTestsHFRPlaybackPerformancePlaybackPerfAV1.1440p.60fps@1X-10.2.68.1] |
ASSUMPTION_FAILURE
|
org.junit.AssumptionViolatedException: Test not enforced
|
| com.google.android.apps.yts.tvts.YtsReport#yts[HFRTestsHFRPlaybackPerformancePlaybackPerfAV1.1440p.60fps@2X-10.2.72.1] |
ASSUMPTION_FAILURE
|
org.junit.AssumptionViolatedException: Test not enforced
|
| com.google.android.apps.yts.tvts.YtsReport#yts[HFRTestsHFRPlaybackPerformancePlaybackPerfAV1.720p.60fps@0.25X-10.2.49.1] |
ASSUMPTION_FAILURE
|
org.junit.AssumptionViolatedException: Test not enforced
|
| com.google.android.apps.yts.tvts.YtsReport#yts[HFRTestsHFRPlaybackPerformancePlaybackPerfAV1.720p.60fps@0.5X-10.2.50.1] |
ASSUMPTION_FAILURE
|
org.junit.AssumptionViolatedException: Test not enforced
|
| com.google.android.apps.yts.tvts.YtsReport#yts[HFRTestsHFRPlaybackPerformancePlaybackPerfAV1.720p.60fps@0.75X-10.2.51.1] |
ASSUMPTION_FAILURE
|
org.junit.AssumptionViolatedException: Test not enforced
|
| com.google.android.apps.yts.tvts.YtsReport#yts[HFRTestsHFRPlaybackPerformancePlaybackPerfAV1.720p.60fps@1.25X-10.2.53.1] |
ASSUMPTION_FAILURE
|
org.junit.AssumptionViolatedException: Test not enforced
|
| com.google.android.apps.yts.tvts.YtsReport#yts[HFRTestsHFRPlaybackPerformancePlaybackPerfAV1.720p.60fps@1.5X-10.2.54.1] |
ASSUMPTION_FAILURE
|
org.junit.AssumptionViolatedException: Test not enforced
|
| com.google.android.apps.yts.tvts.YtsReport#yts[HFRTestsHFRPlaybackPerformancePlaybackPerfAV1.720p.60fps@1.75X-10.2.55.1] |
ASSUMPTION_FAILURE
|
org.junit.AssumptionViolatedException: Test not enforced
|
| com.google.android.apps.yts.tvts.YtsReport#yts[HFRTestsHFRPlaybackPerformancePlaybackPerfAV1.720p.60fps@1X-10.2.52.1] |
ASSUMPTION_FAILURE
|
org.junit.AssumptionViolatedException: Test not enforced
|
| com.google.android.apps.yts.tvts.YtsReport#yts[HFRTestsHFRPlaybackPerformancePlaybackPerfAV1.720p.60fps@2X-10.2.56.1] |
ASSUMPTION_FAILURE
|
org.junit.AssumptionViolatedException: Test not enforced
|
| com.google.android.apps.yts.tvts.YtsReport#yts[HFRTestsHFRPlaybackPerformancePlaybackPerfH264.1080p.60fps@0.25X-10.2.41.1] |
ASSUMPTION_FAILURE
|
org.junit.AssumptionViolatedException: Test not enforced
|
| com.google.android.apps.yts.tvts.YtsReport#yts[HFRTestsHFRPlaybackPerformancePlaybackPerfH264.1080p.60fps@0.5X-10.2.42.1] |
ASSUMPTION_FAILURE
|
org.junit.AssumptionViolatedException: Test not enforced
|
| com.google.android.apps.yts.tvts.YtsReport#yts[HFRTestsHFRPlaybackPerformancePlaybackPerfH264.1080p.60fps@0.75X-10.2.43.1] |
ASSUMPTION_FAILURE
|
org.junit.AssumptionViolatedException: Test not enforced
|
| com.google.android.apps.yts.tvts.YtsReport#yts[HFRTestsHFRPlaybackPerformancePlaybackPerfH264.1080p.60fps@1.25X-10.2.45.1] |
ASSUMPTION_FAILURE
|
org.junit.AssumptionViolatedException: Test not enforced
|
| com.google.android.apps.yts.tvts.YtsReport#yts[HFRTestsHFRPlaybackPerformancePlaybackPerfH264.1080p.60fps@1.5X-10.2.46.1] |
ASSUMPTION_FAILURE
|
org.junit.AssumptionViolatedException: Test not enforced
|
| com.google.android.apps.yts.tvts.YtsReport#yts[HFRTestsHFRPlaybackPerformancePlaybackPerfH264.1080p.60fps@1.75X-10.2.47.1] |
ASSUMPTION_FAILURE
|
org.junit.AssumptionViolatedException: Test not enforced
|
| com.google.android.apps.yts.tvts.YtsReport#yts[HFRTestsHFRPlaybackPerformancePlaybackPerfH264.1080p.60fps@1X-10.2.44.1] |
ASSUMPTION_FAILURE
|
org.junit.AssumptionViolatedException: Test not enforced
|
| com.google.android.apps.yts.tvts.YtsReport#yts[HFRTestsHFRPlaybackPerformancePlaybackPerfH264.1080p.60fps@2X-10.2.48.1] |
ASSUMPTION_FAILURE
|
org.junit.AssumptionViolatedException: Test not enforced
|
| com.google.android.apps.yts.tvts.YtsReport#yts[HFRTestsHFRPlaybackPerformancePlaybackPerfH264.720p.60fps@0.25X-10.2.33.1] |
ASSUMPTION_FAILURE
|
org.junit.AssumptionViolatedException: Test not enforced
|
| com.google.android.apps.yts.tvts.YtsReport#yts[HFRTestsHFRPlaybackPerformancePlaybackPerfH264.720p.60fps@0.5X-10.2.34.1] |
ASSUMPTION_FAILURE
|
org.junit.AssumptionViolatedException: Test not enforced
|
| com.google.android.apps.yts.tvts.YtsReport#yts[HFRTestsHFRPlaybackPerformancePlaybackPerfH264.720p.60fps@0.75X-10.2.35.1] |
ASSUMPTION_FAILURE
|
org.junit.AssumptionViolatedException: Test not enforced
|
| com.google.android.apps.yts.tvts.YtsReport#yts[HFRTestsHFRPlaybackPerformancePlaybackPerfH264.720p.60fps@1.25X-10.2.37.1] |
ASSUMPTION_FAILURE
|
org.junit.AssumptionViolatedException: Test not enforced
|
| com.google.android.apps.yts.tvts.YtsReport#yts[HFRTestsHFRPlaybackPerformancePlaybackPerfH264.720p.60fps@1.5X-10.2.38.1] |
ASSUMPTION_FAILURE
|
org.junit.AssumptionViolatedException: Test not enforced
|
| com.google.android.apps.yts.tvts.YtsReport#yts[HFRTestsHFRPlaybackPerformancePlaybackPerfH264.720p.60fps@1.75X-10.2.39.1] |
ASSUMPTION_FAILURE
|
org.junit.AssumptionViolatedException: Test not enforced
|
| com.google.android.apps.yts.tvts.YtsReport#yts[HFRTestsHFRPlaybackPerformancePlaybackPerfH264.720p.60fps@1X-10.2.36.1] |
ASSUMPTION_FAILURE
|
org.junit.AssumptionViolatedException: Test not enforced
|
| com.google.android.apps.yts.tvts.YtsReport#yts[HFRTestsHFRPlaybackPerformancePlaybackPerfH264.720p.60fps@2X-10.2.40.1] |
ASSUMPTION_FAILURE
|
org.junit.AssumptionViolatedException: Test not enforced
|
| com.google.android.apps.yts.tvts.YtsReport#yts[HFRTestsHFRPlaybackPerformancePlaybackPerfVP9.1080p.60fps@0.25X-10.2.9.1] |
ASSUMPTION_FAILURE
|
org.junit.AssumptionViolatedException: Test not enforced
|
| com.google.android.apps.yts.tvts.YtsReport#yts[HFRTestsHFRPlaybackPerformancePlaybackPerfVP9.1080p.60fps@0.5X-10.2.10.1] |
ASSUMPTION_FAILURE
|
org.junit.AssumptionViolatedException: Test not enforced
|
| com.google.android.apps.yts.tvts.YtsReport#yts[HFRTestsHFRPlaybackPerformancePlaybackPerfVP9.1080p.60fps@0.75X-10.2.11.1] |
ASSUMPTION_FAILURE
|
org.junit.AssumptionViolatedException: Test not enforced
|
| com.google.android.apps.yts.tvts.YtsReport#yts[HFRTestsHFRPlaybackPerformancePlaybackPerfVP9.1080p.60fps@1.25X-10.2.13.1] |
ASSUMPTION_FAILURE
|
org.junit.AssumptionViolatedException: Test not enforced
|
| com.google.android.apps.yts.tvts.YtsReport#yts[HFRTestsHFRPlaybackPerformancePlaybackPerfVP9.1080p.60fps@1.5X-10.2.14.1] |
ASSUMPTION_FAILURE
|
org.junit.AssumptionViolatedException: Test not enforced
|
| com.google.android.apps.yts.tvts.YtsReport#yts[HFRTestsHFRPlaybackPerformancePlaybackPerfVP9.1080p.60fps@1.75X-10.2.15.1] |
ASSUMPTION_FAILURE
|
org.junit.AssumptionViolatedException: Test not enforced
|
| com.google.android.apps.yts.tvts.YtsReport#yts[HFRTestsHFRPlaybackPerformancePlaybackPerfVP9.1080p.60fps@1X-10.2.12.1] |
ASSUMPTION_FAILURE
|
org.junit.AssumptionViolatedException: Test not enforced
|
| com.google.android.apps.yts.tvts.YtsReport#yts[HFRTestsHFRPlaybackPerformancePlaybackPerfVP9.1080p.60fps@2X-10.2.16.1] |
ASSUMPTION_FAILURE
|
org.junit.AssumptionViolatedException: Test not enforced
|
| com.google.android.apps.yts.tvts.YtsReport#yts[HFRTestsHFRPlaybackPerformancePlaybackPerfVP9.1440p.60fps@0.25X-10.2.17.1] |
ASSUMPTION_FAILURE
|
org.junit.AssumptionViolatedException: Test not enforced
|
| com.google.android.apps.yts.tvts.YtsReport#yts[HFRTestsHFRPlaybackPerformancePlaybackPerfVP9.1440p.60fps@0.5X-10.2.18.1] |
ASSUMPTION_FAILURE
|
org.junit.AssumptionViolatedException: Test not enforced
|
| com.google.android.apps.yts.tvts.YtsReport#yts[HFRTestsHFRPlaybackPerformancePlaybackPerfVP9.1440p.60fps@0.75X-10.2.19.1] |
ASSUMPTION_FAILURE
|
org.junit.AssumptionViolatedException: Test not enforced
|
| com.google.android.apps.yts.tvts.YtsReport#yts[HFRTestsHFRPlaybackPerformancePlaybackPerfVP9.1440p.60fps@1.25X-10.2.21.1] |
ASSUMPTION_FAILURE
|
org.junit.AssumptionViolatedException: Test not enforced
|
| com.google.android.apps.yts.tvts.YtsReport#yts[HFRTestsHFRPlaybackPerformancePlaybackPerfVP9.1440p.60fps@1.5X-10.2.22.1] |
ASSUMPTION_FAILURE
|
org.junit.AssumptionViolatedException: Test not enforced
|
| com.google.android.apps.yts.tvts.YtsReport#yts[HFRTestsHFRPlaybackPerformancePlaybackPerfVP9.1440p.60fps@1.75X-10.2.23.1] |
ASSUMPTION_FAILURE
|
org.junit.AssumptionViolatedException: Test not enforced
|
| com.google.android.apps.yts.tvts.YtsReport#yts[HFRTestsHFRPlaybackPerformancePlaybackPerfVP9.1440p.60fps@1X-10.2.20.1] |
ASSUMPTION_FAILURE
|
org.junit.AssumptionViolatedException: Test not enforced
|
| com.google.android.apps.yts.tvts.YtsReport#yts[HFRTestsHFRPlaybackPerformancePlaybackPerfVP9.1440p.60fps@2X-10.2.24.1] |
ASSUMPTION_FAILURE
|
org.junit.AssumptionViolatedException: Test not enforced
|
| com.google.android.apps.yts.tvts.YtsReport#yts[HFRTestsHFRPlaybackPerformancePlaybackPerfVP9.2160p.60fps@0.25X-10.2.25.1] |
ASSUMPTION_FAILURE
|
org.junit.AssumptionViolatedException: Test not enforced
|
| com.google.android.apps.yts.tvts.YtsReport#yts[HFRTestsHFRPlaybackPerformancePlaybackPerfVP9.2160p.60fps@0.5X-10.2.26.1] |
ASSUMPTION_FAILURE
|
org.junit.AssumptionViolatedException: Test not enforced
|
| com.google.android.apps.yts.tvts.YtsReport#yts[HFRTestsHFRPlaybackPerformancePlaybackPerfVP9.2160p.60fps@0.75X-10.2.27.1] |
ASSUMPTION_FAILURE
|
org.junit.AssumptionViolatedException: Test not enforced
|
| com.google.android.apps.yts.tvts.YtsReport#yts[HFRTestsHFRPlaybackPerformancePlaybackPerfVP9.2160p.60fps@1.25X-10.2.29.1] |
ASSUMPTION_FAILURE
|
org.junit.AssumptionViolatedException: Test not enforced
|
| com.google.android.apps.yts.tvts.YtsReport#yts[HFRTestsHFRPlaybackPerformancePlaybackPerfVP9.2160p.60fps@1.5X-10.2.30.1] |
ASSUMPTION_FAILURE
|
org.junit.AssumptionViolatedException: Test not enforced
|
| com.google.android.apps.yts.tvts.YtsReport#yts[HFRTestsHFRPlaybackPerformancePlaybackPerfVP9.2160p.60fps@1.75X-10.2.31.1] |
ASSUMPTION_FAILURE
|
org.junit.AssumptionViolatedException: Test not enforced
|
| com.google.android.apps.yts.tvts.YtsReport#yts[HFRTestsHFRPlaybackPerformancePlaybackPerfVP9.2160p.60fps@1X-10.2.28.1] |
ASSUMPTION_FAILURE
|
org.junit.AssumptionViolatedException: Test not enforced
|
| com.google.android.apps.yts.tvts.YtsReport#yts[HFRTestsHFRPlaybackPerformancePlaybackPerfVP9.2160p.60fps@2X-10.2.32.1] |
ASSUMPTION_FAILURE
|
org.junit.AssumptionViolatedException: Test not enforced
|
| com.google.android.apps.yts.tvts.YtsReport#yts[HFRTestsHFRPlaybackPerformancePlaybackPerfVP9.720p.60fps@0.25X-10.2.1.1] |
ASSUMPTION_FAILURE
|
org.junit.AssumptionViolatedException: Test not enforced
|
| com.google.android.apps.yts.tvts.YtsReport#yts[HFRTestsHFRPlaybackPerformancePlaybackPerfVP9.720p.60fps@0.5X-10.2.2.1] |
ASSUMPTION_FAILURE
|
org.junit.AssumptionViolatedException: Test not enforced
|
| com.google.android.apps.yts.tvts.YtsReport#yts[HFRTestsHFRPlaybackPerformancePlaybackPerfVP9.720p.60fps@0.75X-10.2.3.1] |
ASSUMPTION_FAILURE
|
org.junit.AssumptionViolatedException: Test not enforced
|
| com.google.android.apps.yts.tvts.YtsReport#yts[HFRTestsHFRPlaybackPerformancePlaybackPerfVP9.720p.60fps@1.25X-10.2.5.1] |
ASSUMPTION_FAILURE
|
org.junit.AssumptionViolatedException: Test not enforced
|
| com.google.android.apps.yts.tvts.YtsReport#yts[HFRTestsHFRPlaybackPerformancePlaybackPerfVP9.720p.60fps@1.5X-10.2.6.1] |
ASSUMPTION_FAILURE
|
org.junit.AssumptionViolatedException: Test not enforced
|
| com.google.android.apps.yts.tvts.YtsReport#yts[HFRTestsHFRPlaybackPerformancePlaybackPerfVP9.720p.60fps@1.75X-10.2.7.1] |
ASSUMPTION_FAILURE
|
org.junit.AssumptionViolatedException: Test not enforced
|
| com.google.android.apps.yts.tvts.YtsReport#yts[HFRTestsHFRPlaybackPerformancePlaybackPerfVP9.720p.60fps@1X-10.2.4.1] |
ASSUMPTION_FAILURE
|
org.junit.AssumptionViolatedException: Test not enforced
|
| com.google.android.apps.yts.tvts.YtsReport#yts[HFRTestsHFRPlaybackPerformancePlaybackPerfVP9.720p.60fps@2X-10.2.8.1] |
ASSUMPTION_FAILURE
|
org.junit.AssumptionViolatedException: Test not enforced
|
| com.google.android.apps.yts.tvts.YtsReport#yts[HFRTestsMediaPlaybackQualityFrameDrop-10.1.2.1] |
ASSUMPTION_FAILURE
|
org.junit.AssumptionViolatedException: Test not enforced
|
| com.google.android.apps.yts.tvts.YtsReport#yts[HFRTestsMediaPlaybackQualityTotalVideoFrames-10.1.1.1] |
ASSUMPTION_FAILURE
|
org.junit.AssumptionViolatedException: Test not enforced
|
| com.google.android.apps.yts.tvts.YtsReport#yts[HTMLDOMElementTestsAttributeAttr.name-16.3.1.1] |
ASSUMPTION_FAILURE
|
org.junit.AssumptionViolatedException: Test not enforced
|
| com.google.android.apps.yts.tvts.YtsReport#yts[HTMLDOMElementTestsAttributeAttr.value-16.3.4.1] |
ASSUMPTION_FAILURE
|
org.junit.AssumptionViolatedException: Test not enforced
|
| com.google.android.apps.yts.tvts.YtsReport#yts[HTMLDOMElementTestsElementAnchorElement-16.1.2.1] |
ASSUMPTION_FAILURE
|
org.junit.AssumptionViolatedException: Test not enforced
|
| com.google.android.apps.yts.tvts.YtsReport#yts[HTMLDOMElementTestsElementAudioElement-16.1.3.1] |
ASSUMPTION_FAILURE
|
org.junit.AssumptionViolatedException: Test not enforced
|
| com.google.android.apps.yts.tvts.YtsReport#yts[HTMLDOMElementTestsElementBRElement-16.1.9.1] |
ASSUMPTION_FAILURE
|
org.junit.AssumptionViolatedException: Test not enforced
|
| com.google.android.apps.yts.tvts.YtsReport#yts[HTMLDOMElementTestsElementBodyElement-16.1.8.1] |
ASSUMPTION_FAILURE
|
org.junit.AssumptionViolatedException: Test not enforced
|
| com.google.android.apps.yts.tvts.YtsReport#yts[HTMLDOMElementTestsElementDivElement-16.1.14.1] |
ASSUMPTION_FAILURE
|
org.junit.AssumptionViolatedException: Test not enforced
|
| com.google.android.apps.yts.tvts.YtsReport#yts[HTMLDOMElementTestsElementHTMLElement-16.1.26.1] |
ASSUMPTION_FAILURE
|
org.junit.AssumptionViolatedException: Test not enforced
|
| com.google.android.apps.yts.tvts.YtsReport#yts[HTMLDOMElementTestsElementHeadElement-16.1.21.1] |
ASSUMPTION_FAILURE
|
org.junit.AssumptionViolatedException: Test not enforced
|
| com.google.android.apps.yts.tvts.YtsReport#yts[HTMLDOMElementTestsElementHeading1Element-16.1.22.1] |
ASSUMPTION_FAILURE
|
org.junit.AssumptionViolatedException: Test not enforced
|
| com.google.android.apps.yts.tvts.YtsReport#yts[HTMLDOMElementTestsElementHeading2Element-16.1.23.1] |
ASSUMPTION_FAILURE
|
org.junit.AssumptionViolatedException: Test not enforced
|
| com.google.android.apps.yts.tvts.YtsReport#yts[HTMLDOMElementTestsElementHeading3Element-16.1.24.1] |
ASSUMPTION_FAILURE
|
org.junit.AssumptionViolatedException: Test not enforced
|
| com.google.android.apps.yts.tvts.YtsReport#yts[HTMLDOMElementTestsElementImageElement-16.1.29.1] |
ASSUMPTION_FAILURE
|
org.junit.AssumptionViolatedException: Test not enforced
|
| com.google.android.apps.yts.tvts.YtsReport#yts[HTMLDOMElementTestsElementLinkElement-16.1.34.1] |
ASSUMPTION_FAILURE
|
org.junit.AssumptionViolatedException: Test not enforced
|
| com.google.android.apps.yts.tvts.YtsReport#yts[HTMLDOMElementTestsElementMetaElement-16.1.38.1] |
ASSUMPTION_FAILURE
|
org.junit.AssumptionViolatedException: Test not enforced
|
| com.google.android.apps.yts.tvts.YtsReport#yts[HTMLDOMElementTestsElementParagraphElement-16.1.43.1] |
ASSUMPTION_FAILURE
|
org.junit.AssumptionViolatedException: Test not enforced
|
| com.google.android.apps.yts.tvts.YtsReport#yts[HTMLDOMElementTestsElementScriptElement-16.1.47.1] |
ASSUMPTION_FAILURE
|
org.junit.AssumptionViolatedException: Test not enforced
|
| com.google.android.apps.yts.tvts.YtsReport#yts[HTMLDOMElementTestsElementSpanElement-16.1.49.1] |
ASSUMPTION_FAILURE
|
org.junit.AssumptionViolatedException: Test not enforced
|
| com.google.android.apps.yts.tvts.YtsReport#yts[HTMLDOMElementTestsElementStyleElement-16.1.50.1] |
ASSUMPTION_FAILURE
|
org.junit.AssumptionViolatedException: Test not enforced
|
| com.google.android.apps.yts.tvts.YtsReport#yts[HTMLDOMElementTestsElementTitleElement-16.1.61.1] |
ASSUMPTION_FAILURE
|
org.junit.AssumptionViolatedException: Test not enforced
|
| com.google.android.apps.yts.tvts.YtsReport#yts[HTMLDOMElementTestsElementUnknownElement-16.1.1.1] |
ASSUMPTION_FAILURE
|
org.junit.AssumptionViolatedException: Test not enforced
|
| com.google.android.apps.yts.tvts.YtsReport#yts[HTMLDOMElementTestsElementVideoElement-16.1.63.1] |
ASSUMPTION_FAILURE
|
org.junit.AssumptionViolatedException: Test not enforced
|
| com.google.android.apps.yts.tvts.YtsReport#yts[HTMLDOMElementTestsVideovideo.height-16.2.1.1] |
ASSUMPTION_FAILURE
|
org.junit.AssumptionViolatedException: Test not enforced
|
| com.google.android.apps.yts.tvts.YtsReport#yts[HTMLDOMElementTestsVideovideo.videoHeight-16.2.3.1] |
ASSUMPTION_FAILURE
|
org.junit.AssumptionViolatedException: Test not enforced
|
| com.google.android.apps.yts.tvts.YtsReport#yts[HTMLDOMElementTestsVideovideo.videoWidth-16.2.4.1] |
ASSUMPTION_FAILURE
|
org.junit.AssumptionViolatedException: Test not enforced
|
| com.google.android.apps.yts.tvts.YtsReport#yts[HTMLDOMElementTestsVideovideo.width-16.2.2.1] |
ASSUMPTION_FAILURE
|
org.junit.AssumptionViolatedException: Test not enforced
|
| com.google.android.apps.yts.tvts.YtsReport#yts[MSECodecTestsMSE(AAC)AACAudioWithLargeGap-2.2.13.1] |
ASSUMPTION_FAILURE
|
org.junit.AssumptionViolatedException: Test not enforced
|
| com.google.android.apps.yts.tvts.YtsReport#yts[MSECodecTestsMSE(AAC)AACAudioWithOverlap-2.2.11.1] |
ASSUMPTION_FAILURE
|
org.junit.AssumptionViolatedException: Test not enforced
|
| com.google.android.apps.yts.tvts.YtsReport#yts[MSECodecTestsMSE(AAC)AACAudioWithSmallGap-2.2.12.1] |
ASSUMPTION_FAILURE
|
org.junit.AssumptionViolatedException: Test not enforced
|
| com.google.android.apps.yts.tvts.YtsReport#yts[MSECodecTestsMSE(AAC)AbortAACAudio-2.2.2.1] |
ASSUMPTION_FAILURE
|
org.junit.AssumptionViolatedException: Test not enforced
|
| com.google.android.apps.yts.tvts.YtsReport#yts[MSECodecTestsMSE(AAC)AppendAACAudio-2.2.1.1] |
ASSUMPTION_FAILURE
|
org.junit.AssumptionViolatedException: Test not enforced
|
| com.google.android.apps.yts.tvts.YtsReport#yts[MSECodecTestsMSE(AAC)AppendAACAudioOffset-2.2.7.1] |
ASSUMPTION_FAILURE
|
org.junit.AssumptionViolatedException: Test not enforced
|
| com.google.android.apps.yts.tvts.YtsReport#yts[MSECodecTestsMSE(AAC)AppendAACAudioOutOfOrder-2.2.9.1] |
ASSUMPTION_FAILURE
|
org.junit.AssumptionViolatedException: Test not enforced
|
| com.google.android.apps.yts.tvts.YtsReport#yts[MSECodecTestsMSE(AAC)AppendMultipleInitAACAudio-2.2.8.1] |
ASSUMPTION_FAILURE
|
org.junit.AssumptionViolatedException: Test not enforced
|
| com.google.android.apps.yts.tvts.YtsReport#yts[MSECodecTestsMSE(AAC)BufferedRangeAACAudio-2.2.10.1] |
ASSUMPTION_FAILURE
|
org.junit.AssumptionViolatedException: Test not enforced
|
| com.google.android.apps.yts.tvts.YtsReport#yts[MSECodecTestsMSE(AAC)DelayedAACAudio-2.2.14.1] |
ASSUMPTION_FAILURE
|
org.junit.AssumptionViolatedException: Test not enforced
|
| com.google.android.apps.yts.tvts.YtsReport#yts[MSECodecTestsMSE(AAC)DurationAfterAppendAACAudio-2.2.4.1] |
ASSUMPTION_FAILURE
|
org.junit.AssumptionViolatedException: Test not enforced
|
| com.google.android.apps.yts.tvts.YtsReport#yts[MSECodecTestsMSE(AAC)IncrementalAACAudio-2.2.6.1] |
ASSUMPTION_FAILURE
|
org.junit.AssumptionViolatedException: Test not enforced
|
| com.google.android.apps.yts.tvts.YtsReport#yts[MSECodecTestsMSE(AAC)IncrementalLimitedAACAudio-2.2.6.3] |
ASSUMPTION_FAILURE
|
org.junit.AssumptionViolatedException: Test not enforced
|
| com.google.android.apps.yts.tvts.YtsReport#yts[MSECodecTestsMSE(AAC)LimitedAACAudio-2.2.6.2] |
ASSUMPTION_FAILURE
|
org.junit.AssumptionViolatedException: Test not enforced
|
| com.google.android.apps.yts.tvts.YtsReport#yts[MSECodecTestsMSE(AAC)PausedStateWithAACAudio-2.2.5.1] |
ASSUMPTION_FAILURE
|
org.junit.AssumptionViolatedException: Test not enforced
|
| com.google.android.apps.yts.tvts.YtsReport#yts[MSECodecTestsMSE(AAC)PlaybackOnlyAACAudio-2.2.15.1] |
ASSUMPTION_FAILURE
|
org.junit.AssumptionViolatedException: Test not enforced
|
| com.google.android.apps.yts.tvts.YtsReport#yts[MSECodecTestsMSE(AAC)TimestampOffsetAACAudio-2.2.3.1] |
ASSUMPTION_FAILURE
|
org.junit.AssumptionViolatedException: Test not enforced
|
| com.google.android.apps.yts.tvts.YtsReport#yts[MSECodecTestsMSE(AC3)PlaybackOnlyAC3Audio-AF203C31-6C96-45E5-8B48-5DDF15A8B7A2] |
ASSUMPTION_FAILURE
|
org.junit.AssumptionViolatedException: Test not enforced
|
| com.google.android.apps.yts.tvts.YtsReport#yts[MSECodecTestsMSE(AV1)AV1VideoWithLargeGap-2.5.17.1] |
ASSUMPTION_FAILURE
|
org.junit.AssumptionViolatedException: Test not enforced
|
| com.google.android.apps.yts.tvts.YtsReport#yts[MSECodecTestsMSE(AV1)AV1VideoWithOverlap-2.5.15.1] |
ASSUMPTION_FAILURE
|
org.junit.AssumptionViolatedException: Test not enforced
|
| com.google.android.apps.yts.tvts.YtsReport#yts[MSECodecTestsMSE(AV1)AV1VideoWithSmallGap-2.5.16.1] |
ASSUMPTION_FAILURE
|
org.junit.AssumptionViolatedException: Test not enforced
|
| com.google.android.apps.yts.tvts.YtsReport#yts[MSECodecTestsMSE(AV1)AbortAV1Video-2.5.2.1] |
ASSUMPTION_FAILURE
|
org.junit.AssumptionViolatedException: Test not enforced
|
| com.google.android.apps.yts.tvts.YtsReport#yts[MSECodecTestsMSE(AV1)AppendAV1Video-2.5.1.1] |
ASSUMPTION_FAILURE
|
org.junit.AssumptionViolatedException: Test not enforced
|
| com.google.android.apps.yts.tvts.YtsReport#yts[MSECodecTestsMSE(AV1)AppendAV1VideoOffset-2.5.10.1] |
ASSUMPTION_FAILURE
|
org.junit.AssumptionViolatedException: Test not enforced
|
| com.google.android.apps.yts.tvts.YtsReport#yts[MSECodecTestsMSE(AV1)AppendAV1VideoOutOfOrder-2.5.12.1] |
ASSUMPTION_FAILURE
|
org.junit.AssumptionViolatedException: Test not enforced
|
| com.google.android.apps.yts.tvts.YtsReport#yts[MSECodecTestsMSE(AV1)AppendMultipleInitAV1Video-2.5.11.1] |
ASSUMPTION_FAILURE
|
org.junit.AssumptionViolatedException: Test not enforced
|
| com.google.android.apps.yts.tvts.YtsReport#yts[MSECodecTestsMSE(AV1)BufUnbufSeekAV1-2.5.19.1] |
ASSUMPTION_FAILURE
|
org.junit.AssumptionViolatedException: Test not enforced
|
| com.google.android.apps.yts.tvts.YtsReport#yts[MSECodecTestsMSE(AV1)BufferedRangeAV1Video-2.5.13.1] |
ASSUMPTION_FAILURE
|
org.junit.AssumptionViolatedException: Test not enforced
|
| com.google.android.apps.yts.tvts.YtsReport#yts[MSECodecTestsMSE(AV1)DASHLatencyAV1-2.5.4.1] |
ASSUMPTION_FAILURE
|
org.junit.AssumptionViolatedException: Test not enforced
|
| com.google.android.apps.yts.tvts.YtsReport#yts[MSECodecTestsMSE(AV1)DelayedAV1Video-2.5.20.1] |
ASSUMPTION_FAILURE
|
org.junit.AssumptionViolatedException: Test not enforced
|
| com.google.android.apps.yts.tvts.YtsReport#yts[MSECodecTestsMSE(AV1)DurationAfterAppendAV1Video-2.5.5.1] |
ASSUMPTION_FAILURE
|
org.junit.AssumptionViolatedException: Test not enforced
|
| com.google.android.apps.yts.tvts.YtsReport#yts[MSECodecTestsMSE(AV1)MediaSourceDurationAV1-2.5.14.1] |
ASSUMPTION_FAILURE
|
org.junit.AssumptionViolatedException: Test not enforced
|
| com.google.android.apps.yts.tvts.YtsReport#yts[MSECodecTestsMSE(AV1)PausedStateWithAV1Video-2.5.6.1] |
ASSUMPTION_FAILURE
|
org.junit.AssumptionViolatedException: Test not enforced
|
| com.google.android.apps.yts.tvts.YtsReport#yts[MSECodecTestsMSE(AV1)PlayPartialAV1Segment-2.5.9.1] |
ASSUMPTION_FAILURE
|
org.junit.AssumptionViolatedException: Test not enforced
|
| com.google.android.apps.yts.tvts.YtsReport#yts[MSECodecTestsMSE(AV1)PlaybackOnlyAV1Video-2.5.21.1] |
ASSUMPTION_FAILURE
|
org.junit.AssumptionViolatedException: Test not enforced
|
| com.google.android.apps.yts.tvts.YtsReport#yts[MSECodecTestsMSE(AV1)PlaybackStateAV1-2.5.8.1] |
ASSUMPTION_FAILURE
|
org.junit.AssumptionViolatedException: Test not enforced
|
| com.google.android.apps.yts.tvts.YtsReport#yts[MSECodecTestsMSE(AV1)SeekAV1-2.5.18.1] |
ASSUMPTION_FAILURE
|
org.junit.AssumptionViolatedException: Test not enforced
|
| com.google.android.apps.yts.tvts.YtsReport#yts[MSECodecTestsMSE(AV1)TimestampOffsetAV1Video-2.5.3.1] |
ASSUMPTION_FAILURE
|
org.junit.AssumptionViolatedException: Test not enforced
|
| com.google.android.apps.yts.tvts.YtsReport#yts[MSECodecTestsMSE(AV1)VideoDimensionAV1-2.5.7.1] |
ASSUMPTION_FAILURE
|
org.junit.AssumptionViolatedException: Test not enforced
|
| com.google.android.apps.yts.tvts.YtsReport#yts[MSECodecTestsMSE(EAC3)PlaybackOnlyEAC3Audio-C4A59B61-E4B6-42BB-9445-BA1F9EADD166] |
ASSUMPTION_FAILURE
|
org.junit.AssumptionViolatedException: Test not enforced
|
| com.google.android.apps.yts.tvts.YtsReport#yts[MSECodecTestsMSE(H264)AbortH264Video-2.4.2.1] |
ASSUMPTION_FAILURE
|
org.junit.AssumptionViolatedException: Test not enforced
|
| com.google.android.apps.yts.tvts.YtsReport#yts[MSECodecTestsMSE(H264)AppendH264Video-2.4.1.1] |
ASSUMPTION_FAILURE
|
org.junit.AssumptionViolatedException: Test not enforced
|
| com.google.android.apps.yts.tvts.YtsReport#yts[MSECodecTestsMSE(H264)AppendH264VideoOffset-2.4.10.1] |
ASSUMPTION_FAILURE
|
org.junit.AssumptionViolatedException: Test not enforced
|
| com.google.android.apps.yts.tvts.YtsReport#yts[MSECodecTestsMSE(H264)AppendH264VideoOutOfOrder-2.4.12.1] |
ASSUMPTION_FAILURE
|
org.junit.AssumptionViolatedException: Test not enforced
|
| com.google.android.apps.yts.tvts.YtsReport#yts[MSECodecTestsMSE(H264)AppendMultipleInitH264Video-2.4.11.1] |
ASSUMPTION_FAILURE
|
org.junit.AssumptionViolatedException: Test not enforced
|
| com.google.android.apps.yts.tvts.YtsReport#yts[MSECodecTestsMSE(H264)BufUnbufSeekH264-2.4.19.1] |
ASSUMPTION_FAILURE
|
org.junit.AssumptionViolatedException: Test not enforced
|
| com.google.android.apps.yts.tvts.YtsReport#yts[MSECodecTestsMSE(H264)BufferedRangeH264Video-2.4.13.1] |
ASSUMPTION_FAILURE
|
org.junit.AssumptionViolatedException: Test not enforced
|
| com.google.android.apps.yts.tvts.YtsReport#yts[MSECodecTestsMSE(H264)DASHLatencyH264-2.4.4.1] |
ASSUMPTION_FAILURE
|
org.junit.AssumptionViolatedException: Test not enforced
|
| com.google.android.apps.yts.tvts.YtsReport#yts[MSECodecTestsMSE(H264)DelayedH264Video-2.4.20.1] |
ASSUMPTION_FAILURE
|
org.junit.AssumptionViolatedException: Test not enforced
|
| com.google.android.apps.yts.tvts.YtsReport#yts[MSECodecTestsMSE(H264)DurationAfterAppendH264Video-2.4.5.1] |
ASSUMPTION_FAILURE
|
org.junit.AssumptionViolatedException: Test not enforced
|
| com.google.android.apps.yts.tvts.YtsReport#yts[MSECodecTestsMSE(H264)H264VideoWithLargeGap-2.4.17.1] |
ASSUMPTION_FAILURE
|
org.junit.AssumptionViolatedException: Test not enforced
|
| com.google.android.apps.yts.tvts.YtsReport#yts[MSECodecTestsMSE(H264)H264VideoWithOverlap-2.4.15.1] |
ASSUMPTION_FAILURE
|
org.junit.AssumptionViolatedException: Test not enforced
|
| com.google.android.apps.yts.tvts.YtsReport#yts[MSECodecTestsMSE(H264)H264VideoWithSmallGap-2.4.16.1] |
ASSUMPTION_FAILURE
|
org.junit.AssumptionViolatedException: Test not enforced
|
| com.google.android.apps.yts.tvts.YtsReport#yts[MSECodecTestsMSE(H264)MediaSourceDurationH264-2.4.14.1] |
ASSUMPTION_FAILURE
|
org.junit.AssumptionViolatedException: Test not enforced
|
| com.google.android.apps.yts.tvts.YtsReport#yts[MSECodecTestsMSE(H264)PausedStateWithH264Video-2.4.6.1] |
ASSUMPTION_FAILURE
|
org.junit.AssumptionViolatedException: Test not enforced
|
| com.google.android.apps.yts.tvts.YtsReport#yts[MSECodecTestsMSE(H264)PlayPartialH264Segment-2.4.9.1] |
ASSUMPTION_FAILURE
|
org.junit.AssumptionViolatedException: Test not enforced
|
| com.google.android.apps.yts.tvts.YtsReport#yts[MSECodecTestsMSE(H264)PlaybackOnlyH264Video-2.4.21.1] |
ASSUMPTION_FAILURE
|
org.junit.AssumptionViolatedException: Test not enforced
|
| com.google.android.apps.yts.tvts.YtsReport#yts[MSECodecTestsMSE(H264)PlaybackStateH264-2.4.8.1] |
ASSUMPTION_FAILURE
|
org.junit.AssumptionViolatedException: Test not enforced
|
| com.google.android.apps.yts.tvts.YtsReport#yts[MSECodecTestsMSE(H264)SeekH264-2.4.18.1] |
ASSUMPTION_FAILURE
|
org.junit.AssumptionViolatedException: Test not enforced
|
| com.google.android.apps.yts.tvts.YtsReport#yts[MSECodecTestsMSE(H264)TimestampOffsetH264Video-2.4.3.1] |
ASSUMPTION_FAILURE
|
org.junit.AssumptionViolatedException: Test not enforced
|
| com.google.android.apps.yts.tvts.YtsReport#yts[MSECodecTestsMSE(H264)VideoDimensionH264-2.4.7.1] |
ASSUMPTION_FAILURE
|
org.junit.AssumptionViolatedException: Test not enforced
|
| com.google.android.apps.yts.tvts.YtsReport#yts[MSECodecTestsMSE(Opus)AbortOpusAudio-2.1.2.1] |
ASSUMPTION_FAILURE
|
org.junit.AssumptionViolatedException: Test not enforced
|
| com.google.android.apps.yts.tvts.YtsReport#yts[MSECodecTestsMSE(Opus)AppendMultipleInitOpusAudio-2.1.8.1] |
ASSUMPTION_FAILURE
|
org.junit.AssumptionViolatedException: Test not enforced
|
| com.google.android.apps.yts.tvts.YtsReport#yts[MSECodecTestsMSE(Opus)AppendOpusAudio-2.1.1.1] |
ASSUMPTION_FAILURE
|
org.junit.AssumptionViolatedException: Test not enforced
|
| com.google.android.apps.yts.tvts.YtsReport#yts[MSECodecTestsMSE(Opus)AppendOpusAudioOffset-2.1.7.1] |
ASSUMPTION_FAILURE
|
org.junit.AssumptionViolatedException: Test not enforced
|
| com.google.android.apps.yts.tvts.YtsReport#yts[MSECodecTestsMSE(Opus)AppendOpusAudioOutOfOrder-2.1.9.1] |
ASSUMPTION_FAILURE
|
org.junit.AssumptionViolatedException: Test not enforced
|
| com.google.android.apps.yts.tvts.YtsReport#yts[MSECodecTestsMSE(Opus)BufferedRangeOpusAudio-2.1.10.1] |
ASSUMPTION_FAILURE
|
org.junit.AssumptionViolatedException: Test not enforced
|
| com.google.android.apps.yts.tvts.YtsReport#yts[MSECodecTestsMSE(Opus)DelayedOpusAudio-2.1.14.1] |
ASSUMPTION_FAILURE
|
org.junit.AssumptionViolatedException: Test not enforced
|
| com.google.android.apps.yts.tvts.YtsReport#yts[MSECodecTestsMSE(Opus)DurationAfterAppendOpusAudio-2.1.4.1] |
ASSUMPTION_FAILURE
|
org.junit.AssumptionViolatedException: Test not enforced
|
| com.google.android.apps.yts.tvts.YtsReport#yts[MSECodecTestsMSE(Opus)IncrementalLimitedOpusAudio-2.1.6.3] |
ASSUMPTION_FAILURE
|
org.junit.AssumptionViolatedException: Test not enforced
|
| com.google.android.apps.yts.tvts.YtsReport#yts[MSECodecTestsMSE(Opus)IncrementalOpusAudio-2.1.6.1] |
ASSUMPTION_FAILURE
|
org.junit.AssumptionViolatedException: Test not enforced
|
| com.google.android.apps.yts.tvts.YtsReport#yts[MSECodecTestsMSE(Opus)LimitedOpusAudio-2.1.6.2] |
ASSUMPTION_FAILURE
|
org.junit.AssumptionViolatedException: Test not enforced
|
| com.google.android.apps.yts.tvts.YtsReport#yts[MSECodecTestsMSE(Opus)OpusAudioWithLargeGap-2.1.13.1] |
ASSUMPTION_FAILURE
|
org.junit.AssumptionViolatedException: Test not enforced
|
| com.google.android.apps.yts.tvts.YtsReport#yts[MSECodecTestsMSE(Opus)OpusAudioWithOverlap-2.1.11.1] |
ASSUMPTION_FAILURE
|
org.junit.AssumptionViolatedException: Test not enforced
|
| com.google.android.apps.yts.tvts.YtsReport#yts[MSECodecTestsMSE(Opus)OpusAudioWithSmallGap-2.1.12.1] |
ASSUMPTION_FAILURE
|
org.junit.AssumptionViolatedException: Test not enforced
|
| com.google.android.apps.yts.tvts.YtsReport#yts[MSECodecTestsMSE(Opus)PausedStateWithOpusAudio-2.1.5.1] |
ASSUMPTION_FAILURE
|
org.junit.AssumptionViolatedException: Test not enforced
|
| com.google.android.apps.yts.tvts.YtsReport#yts[MSECodecTestsMSE(Opus)PlaybackOnlyOpusAudio-2.1.15.1] |
ASSUMPTION_FAILURE
|
org.junit.AssumptionViolatedException: Test not enforced
|
| com.google.android.apps.yts.tvts.YtsReport#yts[MSECodecTestsMSE(Opus)TimestampOffsetOpusAudio-2.1.3.1] |
ASSUMPTION_FAILURE
|
org.junit.AssumptionViolatedException: Test not enforced
|
| com.google.android.apps.yts.tvts.YtsReport#yts[MSECodecTestsMSE(VP9)AbortVP9Video-2.3.2.1] |
ASSUMPTION_FAILURE
|
org.junit.AssumptionViolatedException: Test not enforced
|
| com.google.android.apps.yts.tvts.YtsReport#yts[MSECodecTestsMSE(VP9)AppendMultipleInitVP9Video-2.3.11.1] |
ASSUMPTION_FAILURE
|
org.junit.AssumptionViolatedException: Test not enforced
|
| com.google.android.apps.yts.tvts.YtsReport#yts[MSECodecTestsMSE(VP9)AppendVP9Video-2.3.1.1] |
ASSUMPTION_FAILURE
|
org.junit.AssumptionViolatedException: Test not enforced
|
| com.google.android.apps.yts.tvts.YtsReport#yts[MSECodecTestsMSE(VP9)AppendVP9VideoOffset-2.3.10.1] |
ASSUMPTION_FAILURE
|
org.junit.AssumptionViolatedException: Test not enforced
|
| com.google.android.apps.yts.tvts.YtsReport#yts[MSECodecTestsMSE(VP9)AppendVP9VideoOutOfOrder-2.3.12.1] |
ASSUMPTION_FAILURE
|
org.junit.AssumptionViolatedException: Test not enforced
|
| com.google.android.apps.yts.tvts.YtsReport#yts[MSECodecTestsMSE(VP9)BufUnbufSeekVP9-2.3.19.1] |
ASSUMPTION_FAILURE
|
org.junit.AssumptionViolatedException: Test not enforced
|
| com.google.android.apps.yts.tvts.YtsReport#yts[MSECodecTestsMSE(VP9)BufferedRangeVP9Video-2.3.13.1] |
ASSUMPTION_FAILURE
|
org.junit.AssumptionViolatedException: Test not enforced
|
| com.google.android.apps.yts.tvts.YtsReport#yts[MSECodecTestsMSE(VP9)DASHLatencyVP9-2.3.4.1] |
ASSUMPTION_FAILURE
|
org.junit.AssumptionViolatedException: Test not enforced
|
| com.google.android.apps.yts.tvts.YtsReport#yts[MSECodecTestsMSE(VP9)DelayedVP9Video-2.3.20.1] |
ASSUMPTION_FAILURE
|
org.junit.AssumptionViolatedException: Test not enforced
|
| com.google.android.apps.yts.tvts.YtsReport#yts[MSECodecTestsMSE(VP9)DurationAfterAppendVP9Video-2.3.5.1] |
ASSUMPTION_FAILURE
|
org.junit.AssumptionViolatedException: Test not enforced
|
| com.google.android.apps.yts.tvts.YtsReport#yts[MSECodecTestsMSE(VP9)MediaSourceDurationVP9-2.3.14.1] |
ASSUMPTION_FAILURE
|
org.junit.AssumptionViolatedException: Test not enforced
|
| com.google.android.apps.yts.tvts.YtsReport#yts[MSECodecTestsMSE(VP9)PausedStateWithVP9Video-2.3.6.1] |
ASSUMPTION_FAILURE
|
org.junit.AssumptionViolatedException: Test not enforced
|
| com.google.android.apps.yts.tvts.YtsReport#yts[MSECodecTestsMSE(VP9)PlayPartialVP9Segment-2.3.9.1] |
ASSUMPTION_FAILURE
|
org.junit.AssumptionViolatedException: Test not enforced
|
| com.google.android.apps.yts.tvts.YtsReport#yts[MSECodecTestsMSE(VP9)PlaybackOnlyVP9Video-2.3.21.1] |
ASSUMPTION_FAILURE
|
org.junit.AssumptionViolatedException: Test not enforced
|
| com.google.android.apps.yts.tvts.YtsReport#yts[MSECodecTestsMSE(VP9)PlaybackStateVP9-2.3.8.1] |
ASSUMPTION_FAILURE
|
org.junit.AssumptionViolatedException: Test not enforced
|
| com.google.android.apps.yts.tvts.YtsReport#yts[MSECodecTestsMSE(VP9)SeekVP9-2.3.18.1] |
ASSUMPTION_FAILURE
|
org.junit.AssumptionViolatedException: Test not enforced
|
| com.google.android.apps.yts.tvts.YtsReport#yts[MSECodecTestsMSE(VP9)TimestampOffsetVP9Video-2.3.3.1] |
ASSUMPTION_FAILURE
|
org.junit.AssumptionViolatedException: Test not enforced
|
| com.google.android.apps.yts.tvts.YtsReport#yts[MSECodecTestsMSE(VP9)VP9VideoWithLargeGap-2.3.17.1] |
ASSUMPTION_FAILURE
|
org.junit.AssumptionViolatedException: Test not enforced
|
| com.google.android.apps.yts.tvts.YtsReport#yts[MSECodecTestsMSE(VP9)VP9VideoWithOverlap-2.3.15.1] |
ASSUMPTION_FAILURE
|
org.junit.AssumptionViolatedException: Test not enforced
|
| com.google.android.apps.yts.tvts.YtsReport#yts[MSECodecTestsMSE(VP9)VP9VideoWithSmallGap-2.3.16.1] |
ASSUMPTION_FAILURE
|
org.junit.AssumptionViolatedException: Test not enforced
|
| com.google.android.apps.yts.tvts.YtsReport#yts[MSECodecTestsMSE(VP9)VideoDimensionVP9-2.3.7.1] |
ASSUMPTION_FAILURE
|
org.junit.AssumptionViolatedException: Test not enforced
|
| com.google.android.apps.yts.tvts.YtsReport#yts[MSEConformanceTestsMSECoreAddSBException-1.3.4.1] |
ASSUMPTION_FAILURE
|
org.junit.AssumptionViolatedException: Test not enforced
|
| com.google.android.apps.yts.tvts.YtsReport#yts[MSEConformanceTestsMSECoreAddSourceBuffer-1.3.3.1] |
ASSUMPTION_FAILURE
|
org.junit.AssumptionViolatedException: Test not enforced
|
| com.google.android.apps.yts.tvts.YtsReport#yts[MSEConformanceTestsMSECoreAppendWindowEnd-1.3.18.1] |
ASSUMPTION_FAILURE
|
org.junit.AssumptionViolatedException: Test not enforced
|
| com.google.android.apps.yts.tvts.YtsReport#yts[MSEConformanceTestsMSECoreAppendWindowStart-1.3.17.1] |
ASSUMPTION_FAILURE
|
org.junit.AssumptionViolatedException: Test not enforced
|
| com.google.android.apps.yts.tvts.YtsReport#yts[MSEConformanceTestsMSECoreAttach-1.3.2.1] |
ASSUMPTION_FAILURE
|
org.junit.AssumptionViolatedException: Test not enforced
|
| com.google.android.apps.yts.tvts.YtsReport#yts[MSEConformanceTestsMSECoreDuration-1.3.8.1] |
ASSUMPTION_FAILURE
|
org.junit.AssumptionViolatedException: Test not enforced
|
| com.google.android.apps.yts.tvts.YtsReport#yts[MSEConformanceTestsMSECoreEventTimestamp-1.3.15.1] |
ASSUMPTION_FAILURE
|
org.junit.AssumptionViolatedException: Test not enforced
|
| com.google.android.apps.yts.tvts.YtsReport#yts[MSEConformanceTestsMSECoreInitialMSDuration-1.3.6.1] |
ASSUMPTION_FAILURE
|
org.junit.AssumptionViolatedException: Test not enforced
|
| com.google.android.apps.yts.tvts.YtsReport#yts[MSEConformanceTestsMSECoreInitialMSReadyState-1.3.7.1] |
ASSUMPTION_FAILURE
|
org.junit.AssumptionViolatedException: Test not enforced
|
| com.google.android.apps.yts.tvts.YtsReport#yts[MSEConformanceTestsMSECoreMediaElementEvents-1.3.9.1] |
ASSUMPTION_FAILURE
|
org.junit.AssumptionViolatedException: Test not enforced
|
| com.google.android.apps.yts.tvts.YtsReport#yts[MSEConformanceTestsMSECoreMediaSourceEvents-1.3.10.1] |
ASSUMPTION_FAILURE
|
org.junit.AssumptionViolatedException: Test not enforced
|
| com.google.android.apps.yts.tvts.YtsReport#yts[MSEConformanceTestsMSECorePlaybackRateChange-1.3.25.1] |
ASSUMPTION_FAILURE
|
org.junit.AssumptionViolatedException: Test not enforced
|
| com.google.android.apps.yts.tvts.YtsReport#yts[MSEConformanceTestsMSECorePresence-1.3.1.1] |
ASSUMPTION_FAILURE
|
org.junit.AssumptionViolatedException: Test not enforced
|
| com.google.android.apps.yts.tvts.YtsReport#yts[MSEConformanceTestsMSECoreRemoveSourceBuffer-1.3.5.1] |
ASSUMPTION_FAILURE
|
org.junit.AssumptionViolatedException: Test not enforced
|
| com.google.android.apps.yts.tvts.YtsReport#yts[MSEConformanceTestsMSECoreSeekTimeUpdate-1.3.16.1] |
ASSUMPTION_FAILURE
|
org.junit.AssumptionViolatedException: Test not enforced
|
| com.google.android.apps.yts.tvts.YtsReport#yts[MSEConformanceTestsMSECoreStartPlayAtTimeGt0H264+AAC-1.3.13.1] |
ASSUMPTION_FAILURE
|
org.junit.AssumptionViolatedException: Test not enforced
|
| com.google.android.apps.yts.tvts.YtsReport#yts[MSEConformanceTestsMSECoreStartPlayAtTimeGt0VP9+Opus-1.3.14.1] |
ASSUMPTION_FAILURE
|
org.junit.AssumptionViolatedException: Test not enforced
|
| com.google.android.apps.yts.tvts.YtsReport#yts[MSEConformanceTestsMSECoreStartPlayWithoutData-1.3.12.1] |
ASSUMPTION_FAILURE
|
org.junit.AssumptionViolatedException: Test not enforced
|
| com.google.android.apps.yts.tvts.YtsReport#yts[MSEConformanceTestsMSECoreVideoBufferSize-1.3.11.1] |
ASSUMPTION_FAILURE
|
org.junit.AssumptionViolatedException: Test not enforced
|
| com.google.android.apps.yts.tvts.YtsReport#yts[MSEConformanceTestsMSEFormatsAACSupport-1.5.1.1] |
ASSUMPTION_FAILURE
|
org.junit.AssumptionViolatedException: Test not enforced
|
| com.google.android.apps.yts.tvts.YtsReport#yts[MSEConformanceTestsMSEFormatsAV1Support-1.5.5.1] |
ASSUMPTION_FAILURE
|
org.junit.AssumptionViolatedException: Test not enforced
|
| com.google.android.apps.yts.tvts.YtsReport#yts[MSEConformanceTestsMSEFormatsH264Support-1.5.2.1] |
ASSUMPTION_FAILURE
|
org.junit.AssumptionViolatedException: Test not enforced
|
| com.google.android.apps.yts.tvts.YtsReport#yts[MSEConformanceTestsMSEFormatsOpusSupport-1.5.4.1] |
ASSUMPTION_FAILURE
|
org.junit.AssumptionViolatedException: Test not enforced
|
| com.google.android.apps.yts.tvts.YtsReport#yts[MSEConformanceTestsMSEFormatsVP9Support-1.5.3.1] |
ASSUMPTION_FAILURE
|
org.junit.AssumptionViolatedException: Test not enforced
|
| com.google.android.apps.yts.tvts.YtsReport#yts[MSEConformanceTestsMSEcurrentTimeHFRAccuracy-1.4.2.1] |
ASSUMPTION_FAILURE
|
org.junit.AssumptionViolatedException: Test not enforced
|
| com.google.android.apps.yts.tvts.YtsReport#yts[MSEConformanceTestsMSEcurrentTimeHFRPausedAccuracy100ms-1.4.4.2] |
ASSUMPTION_FAILURE
|
org.junit.AssumptionViolatedException: Test not enforced
|
| com.google.android.apps.yts.tvts.YtsReport#yts[MSEConformanceTestsMSEcurrentTimeHFRPausedAccuracy32ms-1.4.4.1] |
ASSUMPTION_FAILURE
|
org.junit.AssumptionViolatedException: Test not enforced
|
| com.google.android.apps.yts.tvts.YtsReport#yts[MSEConformanceTestsMSEcurrentTimeSFRAccuracy-1.4.1.1] |
ASSUMPTION_FAILURE
|
org.junit.AssumptionViolatedException: Test not enforced
|
| com.google.android.apps.yts.tvts.YtsReport#yts[MSEConformanceTestsMSEcurrentTimeSFRPausedAccuracy100ms-1.4.3.2] |
ASSUMPTION_FAILURE
|
org.junit.AssumptionViolatedException: Test not enforced
|
| com.google.android.apps.yts.tvts.YtsReport#yts[MSEConformanceTestsMSEcurrentTimeSFRPausedAccuracy32ms-1.4.3.1] |
ASSUMPTION_FAILURE
|
org.junit.AssumptionViolatedException: Test not enforced
|
| com.google.android.apps.yts.tvts.YtsReport#yts[MSEConformanceTestsMediaH264FrameGaps-1.8.1.1] |
ASSUMPTION_FAILURE
|
org.junit.AssumptionViolatedException: Test not enforced
|
| com.google.android.apps.yts.tvts.YtsReport#yts[MSEConformanceTestsMediaH264FrameOverlaps-1.8.2.1] |
ASSUMPTION_FAILURE
|
org.junit.AssumptionViolatedException: Test not enforced
|
| com.google.android.apps.yts.tvts.YtsReport#yts[MSEConformanceTestsMediaHE-AAC/ExplicitSBR-1.8.3.1] |
ASSUMPTION_FAILURE
|
org.junit.AssumptionViolatedException: Test not enforced
|
| com.google.android.apps.yts.tvts.YtsReport#yts[MSEConformanceTestsMediaHE-AAC/ImplicitSBR-1.8.4.1] |
ASSUMPTION_FAILURE
|
org.junit.AssumptionViolatedException: Test not enforced
|
| com.google.android.apps.yts.tvts.YtsReport#yts[MSEConformanceTestsMediaElementCoreInitialMediaCurrentSrc-1.1.6.1] |
ASSUMPTION_FAILURE
|
org.junit.AssumptionViolatedException: Test not enforced
|
| com.google.android.apps.yts.tvts.YtsReport#yts[MSEConformanceTestsMediaElementCoreInitialMediaDuration-1.1.1.1] |
ASSUMPTION_FAILURE
|
org.junit.AssumptionViolatedException: Test not enforced
|
| com.google.android.apps.yts.tvts.YtsReport#yts[MSEConformanceTestsMediaElementCoreInitialMediaReadyState-1.1.4.1] |
ASSUMPTION_FAILURE
|
org.junit.AssumptionViolatedException: Test not enforced
|
| com.google.android.apps.yts.tvts.YtsReport#yts[MSEConformanceTestsMediaElementCoreInitialMediaSrc-1.1.5.1] |
ASSUMPTION_FAILURE
|
org.junit.AssumptionViolatedException: Test not enforced
|
| com.google.android.apps.yts.tvts.YtsReport#yts[MSEConformanceTestsMediaElementCoreInitialMediaVideoHeight-1.1.3.1] |
ASSUMPTION_FAILURE
|
org.junit.AssumptionViolatedException: Test not enforced
|
| com.google.android.apps.yts.tvts.YtsReport#yts[MSEConformanceTestsMediaElementCoreInitialMediaVideoWidth-1.1.2.1] |
ASSUMPTION_FAILURE
|
org.junit.AssumptionViolatedException: Test not enforced
|
| com.google.android.apps.yts.tvts.YtsReport#yts[MSEConformanceTestsXHRXHRAbort-1.2.2.1] |
ASSUMPTION_FAILURE
|
org.junit.AssumptionViolatedException: Test not enforced
|
| com.google.android.apps.yts.tvts.YtsReport#yts[MSEConformanceTestsXHRXHROpenState-1.2.3.1] |
ASSUMPTION_FAILURE
|
org.junit.AssumptionViolatedException: Test not enforced
|
| com.google.android.apps.yts.tvts.YtsReport#yts[MSEConformanceTestsXHRXHRUint8Array-1.2.1.1] |
ASSUMPTION_FAILURE
|
org.junit.AssumptionViolatedException: Test not enforced
|
| com.google.android.apps.yts.tvts.YtsReport#yts[ProgressiveTestscontrolautoplay-6.5.1.1] |
ASSUMPTION_FAILURE
|
org.junit.AssumptionViolatedException: Test not enforced
|
| com.google.android.apps.yts.tvts.YtsReport#yts[ProgressiveTestseventcanplay-6.4.3.1] |
ASSUMPTION_FAILURE
|
org.junit.AssumptionViolatedException: Test not enforced
|
| com.google.android.apps.yts.tvts.YtsReport#yts[ProgressiveTestseventonprogress-6.4.1.1] |
ASSUMPTION_FAILURE
|
org.junit.AssumptionViolatedException: Test not enforced
|
| com.google.android.apps.yts.tvts.YtsReport#yts[ProgressiveTestseventontimeupdate-6.4.2.1] |
ASSUMPTION_FAILURE
|
org.junit.AssumptionViolatedException: Test not enforced
|
| com.google.android.apps.yts.tvts.YtsReport#yts[ProgressiveTestsplaywithoutdataonwaiting-6.7.2.1] |
ASSUMPTION_FAILURE
|
org.junit.AssumptionViolatedException: Test not enforced
|
| com.google.android.apps.yts.tvts.YtsReport#yts[ProgressiveTestsplaywithoutdatapaused-6.7.1.1] |
ASSUMPTION_FAILURE
|
org.junit.AssumptionViolatedException: Test not enforced
|
| com.google.android.apps.yts.tvts.YtsReport#yts[ProgressiveTestsplaybackRatePlaybackRate0.25-6.9.1.1] |
ASSUMPTION_FAILURE
|
org.junit.AssumptionViolatedException: Test not enforced
|
| com.google.android.apps.yts.tvts.YtsReport#yts[ProgressiveTestsplaybackRatePlaybackRate0.50-6.9.2.1] |
ASSUMPTION_FAILURE
|
org.junit.AssumptionViolatedException: Test not enforced
|
| com.google.android.apps.yts.tvts.YtsReport#yts[ProgressiveTestsplaybackRatePlaybackRate0.75-6.9.7.1] |
ASSUMPTION_FAILURE
|
org.junit.AssumptionViolatedException: Test not enforced
|
| com.google.android.apps.yts.tvts.YtsReport#yts[ProgressiveTestsplaybackRatePlaybackRate1.00-6.9.3.1] |
ASSUMPTION_FAILURE
|
org.junit.AssumptionViolatedException: Test not enforced
|
| com.google.android.apps.yts.tvts.YtsReport#yts[ProgressiveTestsplaybackRatePlaybackRate1.25-6.9.4.1] |
ASSUMPTION_FAILURE
|
org.junit.AssumptionViolatedException: Test not enforced
|
| com.google.android.apps.yts.tvts.YtsReport#yts[ProgressiveTestsplaybackRatePlaybackRate1.50-6.9.5.1] |
ASSUMPTION_FAILURE
|
org.junit.AssumptionViolatedException: Test not enforced
|
| com.google.android.apps.yts.tvts.YtsReport#yts[ProgressiveTestsplaybackRatePlaybackRate1.75-6.9.8.1] |
ASSUMPTION_FAILURE
|
org.junit.AssumptionViolatedException: Test not enforced
|
| com.google.android.apps.yts.tvts.YtsReport#yts[ProgressiveTestsplaybackRatePlaybackRate2.00-6.9.6.1] |
ASSUMPTION_FAILURE
|
org.junit.AssumptionViolatedException: Test not enforced
|
| com.google.android.apps.yts.tvts.YtsReport#yts[ProgressiveTestsstatenetworkState-6.6.1.1] |
ASSUMPTION_FAILURE
|
org.junit.AssumptionViolatedException: Test not enforced
|
| com.google.android.apps.yts.tvts.YtsReport#yts[ProgressiveTestsstateaftersrcassignednetworkState-6.2.1.1] |
ASSUMPTION_FAILURE
|
org.junit.AssumptionViolatedException: Test not enforced
|
| com.google.android.apps.yts.tvts.YtsReport#yts[ProgressiveTestsstateaftersrcassignedreadyState-6.2.2.1] |
ASSUMPTION_FAILURE
|
org.junit.AssumptionViolatedException: Test not enforced
|
| com.google.android.apps.yts.tvts.YtsReport#yts[ProgressiveTestsstateaftersrcassignedsrc-6.2.3.1] |
ASSUMPTION_FAILURE
|
org.junit.AssumptionViolatedException: Test not enforced
|
| com.google.android.apps.yts.tvts.YtsReport#yts[ProgressiveTestsstatebeforeinitialbuffered.length-6.1.11.1] |
ASSUMPTION_FAILURE
|
org.junit.AssumptionViolatedException: Test not enforced
|
| com.google.android.apps.yts.tvts.YtsReport#yts[ProgressiveTestsstatebeforeinitialcurrentSrc-6.1.2.1] |
ASSUMPTION_FAILURE
|
org.junit.AssumptionViolatedException: Test not enforced
|
| com.google.android.apps.yts.tvts.YtsReport#yts[ProgressiveTestsstatebeforeinitialdefaultPlaybackRate-6.1.3.1] |
ASSUMPTION_FAILURE
|
org.junit.AssumptionViolatedException: Test not enforced
|
| com.google.android.apps.yts.tvts.YtsReport#yts[ProgressiveTestsstatebeforeinitialduration-6.1.5.1] |
ASSUMPTION_FAILURE
|
org.junit.AssumptionViolatedException: Test not enforced
|
| com.google.android.apps.yts.tvts.YtsReport#yts[ProgressiveTestsstatebeforeinitialended-6.1.8.1] |
ASSUMPTION_FAILURE
|
org.junit.AssumptionViolatedException: Test not enforced
|
| com.google.android.apps.yts.tvts.YtsReport#yts[ProgressiveTestsstatebeforeinitialnetworkState-6.1.14.1] |
ASSUMPTION_FAILURE
|
org.junit.AssumptionViolatedException: Test not enforced
|
| com.google.android.apps.yts.tvts.YtsReport#yts[ProgressiveTestsstatebeforeinitialpaused-6.1.6.1] |
ASSUMPTION_FAILURE
|
org.junit.AssumptionViolatedException: Test not enforced
|
| com.google.android.apps.yts.tvts.YtsReport#yts[ProgressiveTestsstatebeforeinitialplaybackRate-6.1.4.1] |
ASSUMPTION_FAILURE
|
org.junit.AssumptionViolatedException: Test not enforced
|
| com.google.android.apps.yts.tvts.YtsReport#yts[ProgressiveTestsstatebeforeinitialplayed.length-6.1.12.1] |
ASSUMPTION_FAILURE
|
org.junit.AssumptionViolatedException: Test not enforced
|
| com.google.android.apps.yts.tvts.YtsReport#yts[ProgressiveTestsstatebeforeinitialreadyState-6.1.15.1] |
ASSUMPTION_FAILURE
|
org.junit.AssumptionViolatedException: Test not enforced
|
| com.google.android.apps.yts.tvts.YtsReport#yts[ProgressiveTestsstatebeforeinitialseekable.length-6.1.13.1] |
ASSUMPTION_FAILURE
|
org.junit.AssumptionViolatedException: Test not enforced
|
| com.google.android.apps.yts.tvts.YtsReport#yts[ProgressiveTestsstatebeforeinitialseeking-6.1.7.1] |
ASSUMPTION_FAILURE
|
org.junit.AssumptionViolatedException: Test not enforced
|
| com.google.android.apps.yts.tvts.YtsReport#yts[ProgressiveTestsstatebeforeinitialsrc-6.1.1.1] |
ASSUMPTION_FAILURE
|
org.junit.AssumptionViolatedException: Test not enforced
|
| com.google.android.apps.yts.tvts.YtsReport#yts[ProgressiveTestsstatebeforeinitialvideoHeight-6.1.10.1] |
ASSUMPTION_FAILURE
|
org.junit.AssumptionViolatedException: Test not enforced
|
| com.google.android.apps.yts.tvts.YtsReport#yts[ProgressiveTestsstatebeforeinitialvideoWidth-6.1.9.1] |
ASSUMPTION_FAILURE
|
org.junit.AssumptionViolatedException: Test not enforced
|
| com.google.android.apps.yts.tvts.YtsReport#yts[ProgressiveTestsstateinloadstartcurrentSrc-6.3.3.1] |
ASSUMPTION_FAILURE
|
org.junit.AssumptionViolatedException: Test not enforced
|
| com.google.android.apps.yts.tvts.YtsReport#yts[ProgressiveTestsstateinloadstartnetworkState-6.3.1.1] |
ASSUMPTION_FAILURE
|
org.junit.AssumptionViolatedException: Test not enforced
|
| com.google.android.apps.yts.tvts.YtsReport#yts[ProgressiveTestsstateinloadstartreadyState-6.3.2.1] |
ASSUMPTION_FAILURE
|
org.junit.AssumptionViolatedException: Test not enforced
|
| com.google.android.apps.yts.tvts.YtsReport#yts[ProgressiveTeststimeupdateaccuracy-6.8.13.1] |
ASSUMPTION_FAILURE
|
org.junit.AssumptionViolatedException: Test not enforced
|
| com.google.android.apps.yts.tvts.YtsReport#yts[ProgressiveTeststimeupdatedurationontimeupdate-6.8.16.1] |
ASSUMPTION_FAILURE
|
org.junit.AssumptionViolatedException: Test not enforced
|
| com.google.android.apps.yts.tvts.YtsReport#yts[ProgressiveTeststimeupdatemaxGranularityPlaybackRate0.25-6.8.1.1] |
ASSUMPTION_FAILURE
|
org.junit.AssumptionViolatedException: Test not enforced
|
| com.google.android.apps.yts.tvts.YtsReport#yts[ProgressiveTeststimeupdatemaxGranularityPlaybackRate0.50-6.8.2.1] |
ASSUMPTION_FAILURE
|
org.junit.AssumptionViolatedException: Test not enforced
|
| com.google.android.apps.yts.tvts.YtsReport#yts[ProgressiveTeststimeupdatemaxGranularityPlaybackRate1.00-6.8.3.1] |
ASSUMPTION_FAILURE
|
org.junit.AssumptionViolatedException: Test not enforced
|
| com.google.android.apps.yts.tvts.YtsReport#yts[ProgressiveTeststimeupdatemaxGranularityPlaybackRate1.25-6.8.4.1] |
ASSUMPTION_FAILURE
|
org.junit.AssumptionViolatedException: Test not enforced
|
| com.google.android.apps.yts.tvts.YtsReport#yts[ProgressiveTeststimeupdatemaxGranularityPlaybackRate1.50-6.8.5.1] |
ASSUMPTION_FAILURE
|
org.junit.AssumptionViolatedException: Test not enforced
|
| com.google.android.apps.yts.tvts.YtsReport#yts[ProgressiveTeststimeupdatemaxGranularityPlaybackRate2.00-6.8.6.1] |
ASSUMPTION_FAILURE
|
org.junit.AssumptionViolatedException: Test not enforced
|
| com.google.android.apps.yts.tvts.YtsReport#yts[ProgressiveTeststimeupdateminGranularityPlaybackRate0.25-6.8.7.1] |
ASSUMPTION_FAILURE
|
org.junit.AssumptionViolatedException: Test not enforced
|
| com.google.android.apps.yts.tvts.YtsReport#yts[ProgressiveTeststimeupdateminGranularityPlaybackRate0.50-6.8.8.1] |
ASSUMPTION_FAILURE
|
org.junit.AssumptionViolatedException: Test not enforced
|
| com.google.android.apps.yts.tvts.YtsReport#yts[ProgressiveTeststimeupdateminGranularityPlaybackRate1.00-6.8.9.1] |
ASSUMPTION_FAILURE
|
org.junit.AssumptionViolatedException: Test not enforced
|
| com.google.android.apps.yts.tvts.YtsReport#yts[ProgressiveTeststimeupdateminGranularityPlaybackRate1.25-6.8.10.1] |
ASSUMPTION_FAILURE
|
org.junit.AssumptionViolatedException: Test not enforced
|
| com.google.android.apps.yts.tvts.YtsReport#yts[ProgressiveTeststimeupdateminGranularityPlaybackRate1.50-6.8.11.1] |
ASSUMPTION_FAILURE
|
org.junit.AssumptionViolatedException: Test not enforced
|
| com.google.android.apps.yts.tvts.YtsReport#yts[ProgressiveTeststimeupdateminGranularityPlaybackRate2.00-6.8.12.1] |
ASSUMPTION_FAILURE
|
org.junit.AssumptionViolatedException: Test not enforced
|
| com.google.android.apps.yts.tvts.YtsReport#yts[ProgressiveTeststimeupdateprogressing-6.8.14.1] |
ASSUMPTION_FAILURE
|
org.junit.AssumptionViolatedException: Test not enforced
|
| com.google.android.apps.yts.tvts.YtsReport#yts[ProgressiveTeststimeupdateprogressingafterseek-6.8.15.1] |
ASSUMPTION_FAILURE
|
org.junit.AssumptionViolatedException: Test not enforced
|
| com.google.android.apps.yts.tvts.YtsReport#yts[VP9SFRTestsMediaPlaybackQualityFrameDrop-7.1.2.1] |
ASSUMPTION_FAILURE
|
org.junit.AssumptionViolatedException: Test not enforced
|
| com.google.android.apps.yts.tvts.YtsReport#yts[VP9SFRTestsMediaPlaybackQualityTotalVideoFrames-7.1.1.1] |
ASSUMPTION_FAILURE
|
org.junit.AssumptionViolatedException: Test not enforced
|
| com.google.android.apps.yts.tvts.YtsReport#yts[VP9SFRTestsVP9SFRPlaybackPerformancePlaybackPerfVP9.1080p.30fps@0.25X-7.2.13.1] |
ASSUMPTION_FAILURE
|
org.junit.AssumptionViolatedException: Test not enforced
|
| com.google.android.apps.yts.tvts.YtsReport#yts[VP9SFRTestsVP9SFRPlaybackPerformancePlaybackPerfVP9.1080p.30fps@0.5X-7.2.14.1] |
ASSUMPTION_FAILURE
|
org.junit.AssumptionViolatedException: Test not enforced
|
| com.google.android.apps.yts.tvts.YtsReport#yts[VP9SFRTestsVP9SFRPlaybackPerformancePlaybackPerfVP9.1080p.30fps@0.75X-7.2.15.1] |
ASSUMPTION_FAILURE
|
org.junit.AssumptionViolatedException: Test not enforced
|
| com.google.android.apps.yts.tvts.YtsReport#yts[VP9SFRTestsVP9SFRPlaybackPerformancePlaybackPerfVP9.1080p.30fps@1.25X-7.2.17.1] |
ASSUMPTION_FAILURE
|
org.junit.AssumptionViolatedException: Test not enforced
|
| com.google.android.apps.yts.tvts.YtsReport#yts[VP9SFRTestsVP9SFRPlaybackPerformancePlaybackPerfVP9.1080p.30fps@1.5X-7.2.18.1] |
ASSUMPTION_FAILURE
|
org.junit.AssumptionViolatedException: Test not enforced
|
| com.google.android.apps.yts.tvts.YtsReport#yts[VP9SFRTestsVP9SFRPlaybackPerformancePlaybackPerfVP9.1080p.30fps@1.75X-7.2.19.1] |
ASSUMPTION_FAILURE
|
org.junit.AssumptionViolatedException: Test not enforced
|
| com.google.android.apps.yts.tvts.YtsReport#yts[VP9SFRTestsVP9SFRPlaybackPerformancePlaybackPerfVP9.1080p.30fps@1X-7.2.16.1] |
ASSUMPTION_FAILURE
|
org.junit.AssumptionViolatedException: Test not enforced
|
| com.google.android.apps.yts.tvts.YtsReport#yts[VP9SFRTestsVP9SFRPlaybackPerformancePlaybackPerfVP9.1080p.30fps@2X-7.2.20.1] |
ASSUMPTION_FAILURE
|
org.junit.AssumptionViolatedException: Test not enforced
|
| com.google.android.apps.yts.tvts.YtsReport#yts[VP9SFRTestsVP9SFRPlaybackPerformancePlaybackPerfVP9.1440p.30fps@0.25X-7.2.21.1] |
ASSUMPTION_FAILURE
|
org.junit.AssumptionViolatedException: Test not enforced
|
| com.google.android.apps.yts.tvts.YtsReport#yts[VP9SFRTestsVP9SFRPlaybackPerformancePlaybackPerfVP9.1440p.30fps@0.5X-7.2.22.1] |
ASSUMPTION_FAILURE
|
org.junit.AssumptionViolatedException: Test not enforced
|
| com.google.android.apps.yts.tvts.YtsReport#yts[VP9SFRTestsVP9SFRPlaybackPerformancePlaybackPerfVP9.1440p.30fps@0.75X-7.2.23.1] |
ASSUMPTION_FAILURE
|
org.junit.AssumptionViolatedException: Test not enforced
|
| com.google.android.apps.yts.tvts.YtsReport#yts[VP9SFRTestsVP9SFRPlaybackPerformancePlaybackPerfVP9.1440p.30fps@1.25X-7.2.25.1] |
ASSUMPTION_FAILURE
|
org.junit.AssumptionViolatedException: Test not enforced
|
| com.google.android.apps.yts.tvts.YtsReport#yts[VP9SFRTestsVP9SFRPlaybackPerformancePlaybackPerfVP9.1440p.30fps@1.5X-7.2.26.1] |
ASSUMPTION_FAILURE
|
org.junit.AssumptionViolatedException: Test not enforced
|
| com.google.android.apps.yts.tvts.YtsReport#yts[VP9SFRTestsVP9SFRPlaybackPerformancePlaybackPerfVP9.1440p.30fps@1.75X-7.2.27.1] |
ASSUMPTION_FAILURE
|
org.junit.AssumptionViolatedException: Test not enforced
|
| com.google.android.apps.yts.tvts.YtsReport#yts[VP9SFRTestsVP9SFRPlaybackPerformancePlaybackPerfVP9.1440p.30fps@1X-7.2.24.1] |
ASSUMPTION_FAILURE
|
org.junit.AssumptionViolatedException: Test not enforced
|
| com.google.android.apps.yts.tvts.YtsReport#yts[VP9SFRTestsVP9SFRPlaybackPerformancePlaybackPerfVP9.1440p.30fps@2X-7.2.28.1] |
ASSUMPTION_FAILURE
|
org.junit.AssumptionViolatedException: Test not enforced
|
| com.google.android.apps.yts.tvts.YtsReport#yts[VP9SFRTestsVP9SFRPlaybackPerformancePlaybackPerfVP9.144p.30fps@1X-7.2.1.1] |
ASSUMPTION_FAILURE
|
org.junit.AssumptionViolatedException: Test not enforced
|
| com.google.android.apps.yts.tvts.YtsReport#yts[VP9SFRTestsVP9SFRPlaybackPerformancePlaybackPerfVP9.2160p.30fps@0.25X-7.2.29.1] |
ASSUMPTION_FAILURE
|
org.junit.AssumptionViolatedException: Test not enforced
|
| com.google.android.apps.yts.tvts.YtsReport#yts[VP9SFRTestsVP9SFRPlaybackPerformancePlaybackPerfVP9.2160p.30fps@0.5X-7.2.30.1] |
ASSUMPTION_FAILURE
|
org.junit.AssumptionViolatedException: Test not enforced
|
| com.google.android.apps.yts.tvts.YtsReport#yts[VP9SFRTestsVP9SFRPlaybackPerformancePlaybackPerfVP9.2160p.30fps@0.75X-7.2.31.1] |
ASSUMPTION_FAILURE
|
org.junit.AssumptionViolatedException: Test not enforced
|
| com.google.android.apps.yts.tvts.YtsReport#yts[VP9SFRTestsVP9SFRPlaybackPerformancePlaybackPerfVP9.2160p.30fps@1.25X-7.2.33.1] |
ASSUMPTION_FAILURE
|
org.junit.AssumptionViolatedException: Test not enforced
|
| com.google.android.apps.yts.tvts.YtsReport#yts[VP9SFRTestsVP9SFRPlaybackPerformancePlaybackPerfVP9.2160p.30fps@1.5X-7.2.34.1] |
ASSUMPTION_FAILURE
|
org.junit.AssumptionViolatedException: Test not enforced
|
| com.google.android.apps.yts.tvts.YtsReport#yts[VP9SFRTestsVP9SFRPlaybackPerformancePlaybackPerfVP9.2160p.30fps@1.75X-7.2.35.1] |
ASSUMPTION_FAILURE
|
org.junit.AssumptionViolatedException: Test not enforced
|
| com.google.android.apps.yts.tvts.YtsReport#yts[VP9SFRTestsVP9SFRPlaybackPerformancePlaybackPerfVP9.2160p.30fps@1X-7.2.32.1] |
ASSUMPTION_FAILURE
|
org.junit.AssumptionViolatedException: Test not enforced
|
| com.google.android.apps.yts.tvts.YtsReport#yts[VP9SFRTestsVP9SFRPlaybackPerformancePlaybackPerfVP9.2160p.30fps@2X-7.2.36.1] |
ASSUMPTION_FAILURE
|
org.junit.AssumptionViolatedException: Test not enforced
|
| com.google.android.apps.yts.tvts.YtsReport#yts[VP9SFRTestsVP9SFRPlaybackPerformancePlaybackPerfVP9.240p.30fps@1X-7.2.2.1] |
ASSUMPTION_FAILURE
|
org.junit.AssumptionViolatedException: Test not enforced
|
| com.google.android.apps.yts.tvts.YtsReport#yts[VP9SFRTestsVP9SFRPlaybackPerformancePlaybackPerfVP9.360p.30fps@1X-7.2.3.1] |
ASSUMPTION_FAILURE
|
org.junit.AssumptionViolatedException: Test not enforced
|
| com.google.android.apps.yts.tvts.YtsReport#yts[VP9SFRTestsVP9SFRPlaybackPerformancePlaybackPerfVP9.480p.30fps@1X-7.2.4.1] |
ASSUMPTION_FAILURE
|
org.junit.AssumptionViolatedException: Test not enforced
|
| com.google.android.apps.yts.tvts.YtsReport#yts[VP9SFRTestsVP9SFRPlaybackPerformancePlaybackPerfVP9.720p.30fps@0.25X-7.2.5.1] |
ASSUMPTION_FAILURE
|
org.junit.AssumptionViolatedException: Test not enforced
|
| com.google.android.apps.yts.tvts.YtsReport#yts[VP9SFRTestsVP9SFRPlaybackPerformancePlaybackPerfVP9.720p.30fps@0.5X-7.2.6.1] |
ASSUMPTION_FAILURE
|
org.junit.AssumptionViolatedException: Test not enforced
|
| com.google.android.apps.yts.tvts.YtsReport#yts[VP9SFRTestsVP9SFRPlaybackPerformancePlaybackPerfVP9.720p.30fps@0.75X-7.2.7.1] |
ASSUMPTION_FAILURE
|
org.junit.AssumptionViolatedException: Test not enforced
|
| com.google.android.apps.yts.tvts.YtsReport#yts[VP9SFRTestsVP9SFRPlaybackPerformancePlaybackPerfVP9.720p.30fps@1.25X-7.2.9.1] |
ASSUMPTION_FAILURE
|
org.junit.AssumptionViolatedException: Test not enforced
|
| com.google.android.apps.yts.tvts.YtsReport#yts[VP9SFRTestsVP9SFRPlaybackPerformancePlaybackPerfVP9.720p.30fps@1.5X-7.2.10.1] |
ASSUMPTION_FAILURE
|
org.junit.AssumptionViolatedException: Test not enforced
|
| com.google.android.apps.yts.tvts.YtsReport#yts[VP9SFRTestsVP9SFRPlaybackPerformancePlaybackPerfVP9.720p.30fps@1.75X-7.2.11.1] |
ASSUMPTION_FAILURE
|
org.junit.AssumptionViolatedException: Test not enforced
|
| com.google.android.apps.yts.tvts.YtsReport#yts[VP9SFRTestsVP9SFRPlaybackPerformancePlaybackPerfVP9.720p.30fps@1X-7.2.8.1] |
ASSUMPTION_FAILURE
|
org.junit.AssumptionViolatedException: Test not enforced
|
| com.google.android.apps.yts.tvts.YtsReport#yts[VP9SFRTestsVP9SFRPlaybackPerformancePlaybackPerfVP9.720p.30fps@2X-7.2.12.1] |
ASSUMPTION_FAILURE
|
org.junit.AssumptionViolatedException: Test not enforced
|
| com.google.android.apps.yts.tvts.YtsReport#yts[VP9WidevineSFRTestsMediaPlaybackQualityFrameDrop-11.1.2.1] |
ASSUMPTION_FAILURE
|
org.junit.AssumptionViolatedException: Test not enforced
|
| com.google.android.apps.yts.tvts.YtsReport#yts[VP9WidevineSFRTestsMediaPlaybackQualityTotalVideoFrames-11.1.1.1] |
ASSUMPTION_FAILURE
|
org.junit.AssumptionViolatedException: Test not enforced
|
| com.google.android.apps.yts.tvts.YtsReport#yts[VP9WidevineSFRTestsVP9WidevineSFRPlaybackPerformancePlaybackPerfVP9.1080p.30fps@0.25X-11.2.30.1] |
ASSUMPTION_FAILURE
|
org.junit.AssumptionViolatedException: Test not enforced
|
| com.google.android.apps.yts.tvts.YtsReport#yts[VP9WidevineSFRTestsVP9WidevineSFRPlaybackPerformancePlaybackPerfVP9.1080p.30fps@0.5X-11.2.31.1] |
ASSUMPTION_FAILURE
|
org.junit.AssumptionViolatedException: Test not enforced
|
| com.google.android.apps.yts.tvts.YtsReport#yts[VP9WidevineSFRTestsVP9WidevineSFRPlaybackPerformancePlaybackPerfVP9.1080p.30fps@0.75X-11.2.32.1] |
ASSUMPTION_FAILURE
|
org.junit.AssumptionViolatedException: Test not enforced
|
| com.google.android.apps.yts.tvts.YtsReport#yts[VP9WidevineSFRTestsVP9WidevineSFRPlaybackPerformancePlaybackPerfVP9.1080p.30fps@1.25X-11.2.34.1] |
ASSUMPTION_FAILURE
|
org.junit.AssumptionViolatedException: Test not enforced
|
| com.google.android.apps.yts.tvts.YtsReport#yts[VP9WidevineSFRTestsVP9WidevineSFRPlaybackPerformancePlaybackPerfVP9.1080p.30fps@1.5X-11.2.35.1] |
ASSUMPTION_FAILURE
|
org.junit.AssumptionViolatedException: Test not enforced
|
| com.google.android.apps.yts.tvts.YtsReport#yts[VP9WidevineSFRTestsVP9WidevineSFRPlaybackPerformancePlaybackPerfVP9.1080p.30fps@1.75X-11.2.36.1] |
ASSUMPTION_FAILURE
|
org.junit.AssumptionViolatedException: Test not enforced
|
| com.google.android.apps.yts.tvts.YtsReport#yts[VP9WidevineSFRTestsVP9WidevineSFRPlaybackPerformancePlaybackPerfVP9.1080p.30fps@1X-11.2.33.1] |
ASSUMPTION_FAILURE
|
org.junit.AssumptionViolatedException: Test not enforced
|
| com.google.android.apps.yts.tvts.YtsReport#yts[VP9WidevineSFRTestsVP9WidevineSFRPlaybackPerformancePlaybackPerfVP9.1080p.30fps@2X-11.2.37.1] |
ASSUMPTION_FAILURE
|
org.junit.AssumptionViolatedException: Test not enforced
|
| com.google.android.apps.yts.tvts.YtsReport#yts[VP9WidevineSFRTestsVP9WidevineSFRPlaybackPerformancePlaybackPerfVP9.1080p.HQ.30fps@0.25X-11.2.46.1] |
ASSUMPTION_FAILURE
|
org.junit.AssumptionViolatedException: Test not enforced
|
| com.google.android.apps.yts.tvts.YtsReport#yts[VP9WidevineSFRTestsVP9WidevineSFRPlaybackPerformancePlaybackPerfVP9.1080p.HQ.30fps@0.5X-11.2.47.1] |
ASSUMPTION_FAILURE
|
org.junit.AssumptionViolatedException: Test not enforced
|
| com.google.android.apps.yts.tvts.YtsReport#yts[VP9WidevineSFRTestsVP9WidevineSFRPlaybackPerformancePlaybackPerfVP9.1080p.HQ.30fps@0.75X-11.2.48.1] |
ASSUMPTION_FAILURE
|
org.junit.AssumptionViolatedException: Test not enforced
|
| com.google.android.apps.yts.tvts.YtsReport#yts[VP9WidevineSFRTestsVP9WidevineSFRPlaybackPerformancePlaybackPerfVP9.1080p.HQ.30fps@1.25X-11.2.50.1] |
ASSUMPTION_FAILURE
|
org.junit.AssumptionViolatedException: Test not enforced
|
| com.google.android.apps.yts.tvts.YtsReport#yts[VP9WidevineSFRTestsVP9WidevineSFRPlaybackPerformancePlaybackPerfVP9.1080p.HQ.30fps@1.5X-11.2.51.1] |
ASSUMPTION_FAILURE
|
org.junit.AssumptionViolatedException: Test not enforced
|
| com.google.android.apps.yts.tvts.YtsReport#yts[VP9WidevineSFRTestsVP9WidevineSFRPlaybackPerformancePlaybackPerfVP9.1080p.HQ.30fps@1.75X-11.2.52.1] |
ASSUMPTION_FAILURE
|
org.junit.AssumptionViolatedException: Test not enforced
|
| com.google.android.apps.yts.tvts.YtsReport#yts[VP9WidevineSFRTestsVP9WidevineSFRPlaybackPerformancePlaybackPerfVP9.1080p.HQ.30fps@1X-11.2.49.1] |
ASSUMPTION_FAILURE
|
org.junit.AssumptionViolatedException: Test not enforced
|
| com.google.android.apps.yts.tvts.YtsReport#yts[VP9WidevineSFRTestsVP9WidevineSFRPlaybackPerformancePlaybackPerfVP9.1080p.HQ.30fps@2X-11.2.53.1] |
ASSUMPTION_FAILURE
|
org.junit.AssumptionViolatedException: Test not enforced
|
| com.google.android.apps.yts.tvts.YtsReport#yts[VP9WidevineSFRTestsVP9WidevineSFRPlaybackPerformancePlaybackPerfVP9.1080p.MQ.30fps@0.25X-11.2.38.1] |
ASSUMPTION_FAILURE
|
org.junit.AssumptionViolatedException: Test not enforced
|
| com.google.android.apps.yts.tvts.YtsReport#yts[VP9WidevineSFRTestsVP9WidevineSFRPlaybackPerformancePlaybackPerfVP9.1080p.MQ.30fps@0.5X-11.2.39.1] |
ASSUMPTION_FAILURE
|
org.junit.AssumptionViolatedException: Test not enforced
|
| com.google.android.apps.yts.tvts.YtsReport#yts[VP9WidevineSFRTestsVP9WidevineSFRPlaybackPerformancePlaybackPerfVP9.1080p.MQ.30fps@0.75X-11.2.40.1] |
ASSUMPTION_FAILURE
|
org.junit.AssumptionViolatedException: Test not enforced
|
| com.google.android.apps.yts.tvts.YtsReport#yts[VP9WidevineSFRTestsVP9WidevineSFRPlaybackPerformancePlaybackPerfVP9.1080p.MQ.30fps@1.25X-11.2.42.1] |
ASSUMPTION_FAILURE
|
org.junit.AssumptionViolatedException: Test not enforced
|
| com.google.android.apps.yts.tvts.YtsReport#yts[VP9WidevineSFRTestsVP9WidevineSFRPlaybackPerformancePlaybackPerfVP9.1080p.MQ.30fps@1.5X-11.2.43.1] |
ASSUMPTION_FAILURE
|
org.junit.AssumptionViolatedException: Test not enforced
|
| com.google.android.apps.yts.tvts.YtsReport#yts[VP9WidevineSFRTestsVP9WidevineSFRPlaybackPerformancePlaybackPerfVP9.1080p.MQ.30fps@1.75X-11.2.44.1] |
ASSUMPTION_FAILURE
|
org.junit.AssumptionViolatedException: Test not enforced
|
| com.google.android.apps.yts.tvts.YtsReport#yts[VP9WidevineSFRTestsVP9WidevineSFRPlaybackPerformancePlaybackPerfVP9.1080p.MQ.30fps@1X-11.2.41.1] |
ASSUMPTION_FAILURE
|
org.junit.AssumptionViolatedException: Test not enforced
|
| com.google.android.apps.yts.tvts.YtsReport#yts[VP9WidevineSFRTestsVP9WidevineSFRPlaybackPerformancePlaybackPerfVP9.1080p.MQ.30fps@2X-11.2.45.1] |
ASSUMPTION_FAILURE
|
org.junit.AssumptionViolatedException: Test not enforced
|
| com.google.android.apps.yts.tvts.YtsReport#yts[VP9WidevineSFRTestsVP9WidevineSFRPlaybackPerformancePlaybackPerfVP9.1440p.24fps@0.25X-11.2.54.1] |
ASSUMPTION_FAILURE
|
org.junit.AssumptionViolatedException: Test not enforced
|
| com.google.android.apps.yts.tvts.YtsReport#yts[VP9WidevineSFRTestsVP9WidevineSFRPlaybackPerformancePlaybackPerfVP9.1440p.24fps@0.5X-11.2.55.1] |
ASSUMPTION_FAILURE
|
org.junit.AssumptionViolatedException: Test not enforced
|
| com.google.android.apps.yts.tvts.YtsReport#yts[VP9WidevineSFRTestsVP9WidevineSFRPlaybackPerformancePlaybackPerfVP9.1440p.24fps@0.75X-11.2.56.1] |
ASSUMPTION_FAILURE
|
org.junit.AssumptionViolatedException: Test not enforced
|
| com.google.android.apps.yts.tvts.YtsReport#yts[VP9WidevineSFRTestsVP9WidevineSFRPlaybackPerformancePlaybackPerfVP9.1440p.24fps@1.25X-11.2.58.1] |
ASSUMPTION_FAILURE
|
org.junit.AssumptionViolatedException: Test not enforced
|
| com.google.android.apps.yts.tvts.YtsReport#yts[VP9WidevineSFRTestsVP9WidevineSFRPlaybackPerformancePlaybackPerfVP9.1440p.24fps@1.5X-11.2.59.1] |
ASSUMPTION_FAILURE
|
org.junit.AssumptionViolatedException: Test not enforced
|
| com.google.android.apps.yts.tvts.YtsReport#yts[VP9WidevineSFRTestsVP9WidevineSFRPlaybackPerformancePlaybackPerfVP9.1440p.24fps@1.75X-11.2.60.1] |
ASSUMPTION_FAILURE
|
org.junit.AssumptionViolatedException: Test not enforced
|
| com.google.android.apps.yts.tvts.YtsReport#yts[VP9WidevineSFRTestsVP9WidevineSFRPlaybackPerformancePlaybackPerfVP9.1440p.24fps@1X-11.2.57.1] |
ASSUMPTION_FAILURE
|
org.junit.AssumptionViolatedException: Test not enforced
|
| com.google.android.apps.yts.tvts.YtsReport#yts[VP9WidevineSFRTestsVP9WidevineSFRPlaybackPerformancePlaybackPerfVP9.1440p.24fps@2X-11.2.61.1] |
ASSUMPTION_FAILURE
|
org.junit.AssumptionViolatedException: Test not enforced
|
| com.google.android.apps.yts.tvts.YtsReport#yts[VP9WidevineSFRTestsVP9WidevineSFRPlaybackPerformancePlaybackPerfVP9.2160p.24fps@0.25X-11.2.62.1] |
ASSUMPTION_FAILURE
|
org.junit.AssumptionViolatedException: Test not enforced
|
| com.google.android.apps.yts.tvts.YtsReport#yts[VP9WidevineSFRTestsVP9WidevineSFRPlaybackPerformancePlaybackPerfVP9.2160p.24fps@0.5X-11.2.63.1] |
ASSUMPTION_FAILURE
|
org.junit.AssumptionViolatedException: Test not enforced
|
| com.google.android.apps.yts.tvts.YtsReport#yts[VP9WidevineSFRTestsVP9WidevineSFRPlaybackPerformancePlaybackPerfVP9.2160p.24fps@0.75X-11.2.64.1] |
ASSUMPTION_FAILURE
|
org.junit.AssumptionViolatedException: Test not enforced
|
| com.google.android.apps.yts.tvts.YtsReport#yts[VP9WidevineSFRTestsVP9WidevineSFRPlaybackPerformancePlaybackPerfVP9.2160p.24fps@1.25X-11.2.66.1] |
ASSUMPTION_FAILURE
|
org.junit.AssumptionViolatedException: Test not enforced
|
| com.google.android.apps.yts.tvts.YtsReport#yts[VP9WidevineSFRTestsVP9WidevineSFRPlaybackPerformancePlaybackPerfVP9.2160p.24fps@1.5X-11.2.67.1] |
ASSUMPTION_FAILURE
|
org.junit.AssumptionViolatedException: Test not enforced
|
| com.google.android.apps.yts.tvts.YtsReport#yts[VP9WidevineSFRTestsVP9WidevineSFRPlaybackPerformancePlaybackPerfVP9.2160p.24fps@1.75X-11.2.68.1] |
ASSUMPTION_FAILURE
|
org.junit.AssumptionViolatedException: Test not enforced
|
| com.google.android.apps.yts.tvts.YtsReport#yts[VP9WidevineSFRTestsVP9WidevineSFRPlaybackPerformancePlaybackPerfVP9.2160p.24fps@1X-11.2.65.1] |
ASSUMPTION_FAILURE
|
org.junit.AssumptionViolatedException: Test not enforced
|
| com.google.android.apps.yts.tvts.YtsReport#yts[VP9WidevineSFRTestsVP9WidevineSFRPlaybackPerformancePlaybackPerfVP9.2160p.24fps@2X-11.2.69.1] |
ASSUMPTION_FAILURE
|
org.junit.AssumptionViolatedException: Test not enforced
|
| com.google.android.apps.yts.tvts.YtsReport#yts[VP9WidevineSFRTestsVP9WidevineSFRPlaybackPerformancePlaybackPerfVP9.240p.30fps@1X-11.2.1.1] |
ASSUMPTION_FAILURE
|
org.junit.AssumptionViolatedException: Test not enforced
|
| com.google.android.apps.yts.tvts.YtsReport#yts[VP9WidevineSFRTestsVP9WidevineSFRPlaybackPerformancePlaybackPerfVP9.360p.30fps@1X-11.2.2.1] |
ASSUMPTION_FAILURE
|
org.junit.AssumptionViolatedException: Test not enforced
|
| com.google.android.apps.yts.tvts.YtsReport#yts[VP9WidevineSFRTestsVP9WidevineSFRPlaybackPerformancePlaybackPerfVP9.480p.30fps@1X-11.2.3.1] |
ASSUMPTION_FAILURE
|
org.junit.AssumptionViolatedException: Test not enforced
|
| com.google.android.apps.yts.tvts.YtsReport#yts[VP9WidevineSFRTestsVP9WidevineSFRPlaybackPerformancePlaybackPerfVP9.480p.HQ.30fps@1X-11.2.5.1] |
ASSUMPTION_FAILURE
|
org.junit.AssumptionViolatedException: Test not enforced
|
| com.google.android.apps.yts.tvts.YtsReport#yts[VP9WidevineSFRTestsVP9WidevineSFRPlaybackPerformancePlaybackPerfVP9.480p.MQ.30fps@1X-11.2.4.1] |
ASSUMPTION_FAILURE
|
org.junit.AssumptionViolatedException: Test not enforced
|
| com.google.android.apps.yts.tvts.YtsReport#yts[VP9WidevineSFRTestsVP9WidevineSFRPlaybackPerformancePlaybackPerfVP9.720p.30fps@0.25X-11.2.6.1] |
ASSUMPTION_FAILURE
|
org.junit.AssumptionViolatedException: Test not enforced
|
| com.google.android.apps.yts.tvts.YtsReport#yts[VP9WidevineSFRTestsVP9WidevineSFRPlaybackPerformancePlaybackPerfVP9.720p.30fps@0.5X-11.2.7.1] |
ASSUMPTION_FAILURE
|
org.junit.AssumptionViolatedException: Test not enforced
|
| com.google.android.apps.yts.tvts.YtsReport#yts[VP9WidevineSFRTestsVP9WidevineSFRPlaybackPerformancePlaybackPerfVP9.720p.30fps@0.75X-11.2.8.1] |
ASSUMPTION_FAILURE
|
org.junit.AssumptionViolatedException: Test not enforced
|
| com.google.android.apps.yts.tvts.YtsReport#yts[VP9WidevineSFRTestsVP9WidevineSFRPlaybackPerformancePlaybackPerfVP9.720p.30fps@1.25X-11.2.10.1] |
ASSUMPTION_FAILURE
|
org.junit.AssumptionViolatedException: Test not enforced
|
| com.google.android.apps.yts.tvts.YtsReport#yts[VP9WidevineSFRTestsVP9WidevineSFRPlaybackPerformancePlaybackPerfVP9.720p.30fps@1.5X-11.2.11.1] |
ASSUMPTION_FAILURE
|
org.junit.AssumptionViolatedException: Test not enforced
|
| com.google.android.apps.yts.tvts.YtsReport#yts[VP9WidevineSFRTestsVP9WidevineSFRPlaybackPerformancePlaybackPerfVP9.720p.30fps@1.75X-11.2.12.1] |
ASSUMPTION_FAILURE
|
org.junit.AssumptionViolatedException: Test not enforced
|
| com.google.android.apps.yts.tvts.YtsReport#yts[VP9WidevineSFRTestsVP9WidevineSFRPlaybackPerformancePlaybackPerfVP9.720p.30fps@1X-11.2.9.1] |
ASSUMPTION_FAILURE
|
org.junit.AssumptionViolatedException: Test not enforced
|
| com.google.android.apps.yts.tvts.YtsReport#yts[VP9WidevineSFRTestsVP9WidevineSFRPlaybackPerformancePlaybackPerfVP9.720p.30fps@2X-11.2.13.1] |
ASSUMPTION_FAILURE
|
org.junit.AssumptionViolatedException: Test not enforced
|
| com.google.android.apps.yts.tvts.YtsReport#yts[VP9WidevineSFRTestsVP9WidevineSFRPlaybackPerformancePlaybackPerfVP9.720p.HQ.30fps@0.25X-11.2.22.1] |
ASSUMPTION_FAILURE
|
org.junit.AssumptionViolatedException: Test not enforced
|
| com.google.android.apps.yts.tvts.YtsReport#yts[VP9WidevineSFRTestsVP9WidevineSFRPlaybackPerformancePlaybackPerfVP9.720p.HQ.30fps@0.5X-11.2.23.1] |
ASSUMPTION_FAILURE
|
org.junit.AssumptionViolatedException: Test not enforced
|
| com.google.android.apps.yts.tvts.YtsReport#yts[VP9WidevineSFRTestsVP9WidevineSFRPlaybackPerformancePlaybackPerfVP9.720p.HQ.30fps@0.75X-11.2.24.1] |
ASSUMPTION_FAILURE
|
org.junit.AssumptionViolatedException: Test not enforced
|
| com.google.android.apps.yts.tvts.YtsReport#yts[VP9WidevineSFRTestsVP9WidevineSFRPlaybackPerformancePlaybackPerfVP9.720p.HQ.30fps@1.25X-11.2.26.1] |
ASSUMPTION_FAILURE
|
org.junit.AssumptionViolatedException: Test not enforced
|
| com.google.android.apps.yts.tvts.YtsReport#yts[VP9WidevineSFRTestsVP9WidevineSFRPlaybackPerformancePlaybackPerfVP9.720p.HQ.30fps@1.5X-11.2.27.1] |
ASSUMPTION_FAILURE
|
org.junit.AssumptionViolatedException: Test not enforced
|
| com.google.android.apps.yts.tvts.YtsReport#yts[VP9WidevineSFRTestsVP9WidevineSFRPlaybackPerformancePlaybackPerfVP9.720p.HQ.30fps@1.75X-11.2.28.1] |
ASSUMPTION_FAILURE
|
org.junit.AssumptionViolatedException: Test not enforced
|
| com.google.android.apps.yts.tvts.YtsReport#yts[VP9WidevineSFRTestsVP9WidevineSFRPlaybackPerformancePlaybackPerfVP9.720p.HQ.30fps@1X-11.2.25.1] |
ASSUMPTION_FAILURE
|
org.junit.AssumptionViolatedException: Test not enforced
|
| com.google.android.apps.yts.tvts.YtsReport#yts[VP9WidevineSFRTestsVP9WidevineSFRPlaybackPerformancePlaybackPerfVP9.720p.HQ.30fps@2X-11.2.29.1] |
ASSUMPTION_FAILURE
|
org.junit.AssumptionViolatedException: Test not enforced
|
| com.google.android.apps.yts.tvts.YtsReport#yts[VP9WidevineSFRTestsVP9WidevineSFRPlaybackPerformancePlaybackPerfVP9.720p.MQ.30fps@0.25X-11.2.14.1] |
ASSUMPTION_FAILURE
|
org.junit.AssumptionViolatedException: Test not enforced
|
| com.google.android.apps.yts.tvts.YtsReport#yts[VP9WidevineSFRTestsVP9WidevineSFRPlaybackPerformancePlaybackPerfVP9.720p.MQ.30fps@0.5X-11.2.15.1] |
ASSUMPTION_FAILURE
|
org.junit.AssumptionViolatedException: Test not enforced
|
| com.google.android.apps.yts.tvts.YtsReport#yts[VP9WidevineSFRTestsVP9WidevineSFRPlaybackPerformancePlaybackPerfVP9.720p.MQ.30fps@0.75X-11.2.16.1] |
ASSUMPTION_FAILURE
|
org.junit.AssumptionViolatedException: Test not enforced
|
| com.google.android.apps.yts.tvts.YtsReport#yts[VP9WidevineSFRTestsVP9WidevineSFRPlaybackPerformancePlaybackPerfVP9.720p.MQ.30fps@1.25X-11.2.18.1] |
ASSUMPTION_FAILURE
|
org.junit.AssumptionViolatedException: Test not enforced
|
| com.google.android.apps.yts.tvts.YtsReport#yts[VP9WidevineSFRTestsVP9WidevineSFRPlaybackPerformancePlaybackPerfVP9.720p.MQ.30fps@1.5X-11.2.19.1] |
ASSUMPTION_FAILURE
|
org.junit.AssumptionViolatedException: Test not enforced
|
| com.google.android.apps.yts.tvts.YtsReport#yts[VP9WidevineSFRTestsVP9WidevineSFRPlaybackPerformancePlaybackPerfVP9.720p.MQ.30fps@1.75X-11.2.20.1] |
ASSUMPTION_FAILURE
|
org.junit.AssumptionViolatedException: Test not enforced
|
| com.google.android.apps.yts.tvts.YtsReport#yts[VP9WidevineSFRTestsVP9WidevineSFRPlaybackPerformancePlaybackPerfVP9.720p.MQ.30fps@1X-11.2.17.1] |
ASSUMPTION_FAILURE
|
org.junit.AssumptionViolatedException: Test not enforced
|
| com.google.android.apps.yts.tvts.YtsReport#yts[VP9WidevineSFRTestsVP9WidevineSFRPlaybackPerformancePlaybackPerfVP9.720p.MQ.30fps@2X-11.2.21.1] |
ASSUMPTION_FAILURE
|
org.junit.AssumptionViolatedException: Test not enforced
|
| com.google.android.apps.yts.tvts.YtsReport#yts[WidevineHFRTestsMediaPlaybackQualityFrameDrop-13.1.2.1] |
ASSUMPTION_FAILURE
|
org.junit.AssumptionViolatedException: Test not enforced
|
| com.google.android.apps.yts.tvts.YtsReport#yts[WidevineHFRTestsMediaPlaybackQualityTotalVideoFrames-13.1.1.1] |
ASSUMPTION_FAILURE
|
org.junit.AssumptionViolatedException: Test not enforced
|
| com.google.android.apps.yts.tvts.YtsReport#yts[WidevineHFRTestsWidevineHFRPlaybackPerformancePlaybackPerfH264.1080p.60fps@0.25X-13.2.49.1] |
ASSUMPTION_FAILURE
|
org.junit.AssumptionViolatedException: Test not enforced
|
| com.google.android.apps.yts.tvts.YtsReport#yts[WidevineHFRTestsWidevineHFRPlaybackPerformancePlaybackPerfH264.1080p.60fps@0.5X-13.2.50.1] |
ASSUMPTION_FAILURE
|
org.junit.AssumptionViolatedException: Test not enforced
|
| com.google.android.apps.yts.tvts.YtsReport#yts[WidevineHFRTestsWidevineHFRPlaybackPerformancePlaybackPerfH264.1080p.60fps@0.75X-13.2.51.1] |
ASSUMPTION_FAILURE
|
org.junit.AssumptionViolatedException: Test not enforced
|
| com.google.android.apps.yts.tvts.YtsReport#yts[WidevineHFRTestsWidevineHFRPlaybackPerformancePlaybackPerfH264.1080p.60fps@1.25X-13.2.53.1] |
ASSUMPTION_FAILURE
|
org.junit.AssumptionViolatedException: Test not enforced
|
| com.google.android.apps.yts.tvts.YtsReport#yts[WidevineHFRTestsWidevineHFRPlaybackPerformancePlaybackPerfH264.1080p.60fps@1.5X-13.2.54.1] |
ASSUMPTION_FAILURE
|
org.junit.AssumptionViolatedException: Test not enforced
|
| com.google.android.apps.yts.tvts.YtsReport#yts[WidevineHFRTestsWidevineHFRPlaybackPerformancePlaybackPerfH264.1080p.60fps@1.75X-13.2.55.1] |
ASSUMPTION_FAILURE
|
org.junit.AssumptionViolatedException: Test not enforced
|
| com.google.android.apps.yts.tvts.YtsReport#yts[WidevineHFRTestsWidevineHFRPlaybackPerformancePlaybackPerfH264.1080p.60fps@1X-13.2.52.1] |
ASSUMPTION_FAILURE
|
org.junit.AssumptionViolatedException: Test not enforced
|
| com.google.android.apps.yts.tvts.YtsReport#yts[WidevineHFRTestsWidevineHFRPlaybackPerformancePlaybackPerfH264.1080p.60fps@2X-13.2.56.1] |
ASSUMPTION_FAILURE
|
org.junit.AssumptionViolatedException: Test not enforced
|
| com.google.android.apps.yts.tvts.YtsReport#yts[WidevineHFRTestsWidevineHFRPlaybackPerformancePlaybackPerfH264.1080p.MQ.60fps@0.25X-13.2.57.1] |
ASSUMPTION_FAILURE
|
org.junit.AssumptionViolatedException: Test not enforced
|
| com.google.android.apps.yts.tvts.YtsReport#yts[WidevineHFRTestsWidevineHFRPlaybackPerformancePlaybackPerfH264.1080p.MQ.60fps@0.5X-13.2.58.1] |
ASSUMPTION_FAILURE
|
org.junit.AssumptionViolatedException: Test not enforced
|
| com.google.android.apps.yts.tvts.YtsReport#yts[WidevineHFRTestsWidevineHFRPlaybackPerformancePlaybackPerfH264.1080p.MQ.60fps@0.75X-13.2.59.1] |
ASSUMPTION_FAILURE
|
org.junit.AssumptionViolatedException: Test not enforced
|
| com.google.android.apps.yts.tvts.YtsReport#yts[WidevineHFRTestsWidevineHFRPlaybackPerformancePlaybackPerfH264.1080p.MQ.60fps@1.25X-13.2.61.1] |
ASSUMPTION_FAILURE
|
org.junit.AssumptionViolatedException: Test not enforced
|
| com.google.android.apps.yts.tvts.YtsReport#yts[WidevineHFRTestsWidevineHFRPlaybackPerformancePlaybackPerfH264.1080p.MQ.60fps@1.5X-13.2.62.1] |
ASSUMPTION_FAILURE
|
org.junit.AssumptionViolatedException: Test not enforced
|
| com.google.android.apps.yts.tvts.YtsReport#yts[WidevineHFRTestsWidevineHFRPlaybackPerformancePlaybackPerfH264.1080p.MQ.60fps@1.75X-13.2.63.1] |
ASSUMPTION_FAILURE
|
org.junit.AssumptionViolatedException: Test not enforced
|
| com.google.android.apps.yts.tvts.YtsReport#yts[WidevineHFRTestsWidevineHFRPlaybackPerformancePlaybackPerfH264.1080p.MQ.60fps@1X-13.2.60.1] |
ASSUMPTION_FAILURE
|
org.junit.AssumptionViolatedException: Test not enforced
|
| com.google.android.apps.yts.tvts.YtsReport#yts[WidevineHFRTestsWidevineHFRPlaybackPerformancePlaybackPerfH264.1080p.MQ.60fps@2X-13.2.64.1] |
ASSUMPTION_FAILURE
|
org.junit.AssumptionViolatedException: Test not enforced
|
| com.google.android.apps.yts.tvts.YtsReport#yts[WidevineHFRTestsWidevineHFRPlaybackPerformancePlaybackPerfH264.720p.60fps@0.25X-13.2.33.1] |
ASSUMPTION_FAILURE
|
org.junit.AssumptionViolatedException: Test not enforced
|
| com.google.android.apps.yts.tvts.YtsReport#yts[WidevineHFRTestsWidevineHFRPlaybackPerformancePlaybackPerfH264.720p.60fps@0.5X-13.2.34.1] |
ASSUMPTION_FAILURE
|
org.junit.AssumptionViolatedException: Test not enforced
|
| com.google.android.apps.yts.tvts.YtsReport#yts[WidevineHFRTestsWidevineHFRPlaybackPerformancePlaybackPerfH264.720p.60fps@0.75X-13.2.35.1] |
ASSUMPTION_FAILURE
|
org.junit.AssumptionViolatedException: Test not enforced
|
| com.google.android.apps.yts.tvts.YtsReport#yts[WidevineHFRTestsWidevineHFRPlaybackPerformancePlaybackPerfH264.720p.60fps@1.25X-13.2.37.1] |
ASSUMPTION_FAILURE
|
org.junit.AssumptionViolatedException: Test not enforced
|
| com.google.android.apps.yts.tvts.YtsReport#yts[WidevineHFRTestsWidevineHFRPlaybackPerformancePlaybackPerfH264.720p.60fps@1.5X-13.2.38.1] |
ASSUMPTION_FAILURE
|
org.junit.AssumptionViolatedException: Test not enforced
|
| com.google.android.apps.yts.tvts.YtsReport#yts[WidevineHFRTestsWidevineHFRPlaybackPerformancePlaybackPerfH264.720p.60fps@1.75X-13.2.39.1] |
ASSUMPTION_FAILURE
|
org.junit.AssumptionViolatedException: Test not enforced
|
| com.google.android.apps.yts.tvts.YtsReport#yts[WidevineHFRTestsWidevineHFRPlaybackPerformancePlaybackPerfH264.720p.60fps@1X-13.2.36.1] |
ASSUMPTION_FAILURE
|
org.junit.AssumptionViolatedException: Test not enforced
|
| com.google.android.apps.yts.tvts.YtsReport#yts[WidevineHFRTestsWidevineHFRPlaybackPerformancePlaybackPerfH264.720p.60fps@2X-13.2.40.1] |
ASSUMPTION_FAILURE
|
org.junit.AssumptionViolatedException: Test not enforced
|
| com.google.android.apps.yts.tvts.YtsReport#yts[WidevineHFRTestsWidevineHFRPlaybackPerformancePlaybackPerfH264.720p.MQ.60fps@0.25X-13.2.41.1] |
ASSUMPTION_FAILURE
|
org.junit.AssumptionViolatedException: Test not enforced
|
| com.google.android.apps.yts.tvts.YtsReport#yts[WidevineHFRTestsWidevineHFRPlaybackPerformancePlaybackPerfH264.720p.MQ.60fps@0.5X-13.2.42.1] |
ASSUMPTION_FAILURE
|
org.junit.AssumptionViolatedException: Test not enforced
|
| com.google.android.apps.yts.tvts.YtsReport#yts[WidevineHFRTestsWidevineHFRPlaybackPerformancePlaybackPerfH264.720p.MQ.60fps@0.75X-13.2.43.1] |
ASSUMPTION_FAILURE
|
org.junit.AssumptionViolatedException: Test not enforced
|
| com.google.android.apps.yts.tvts.YtsReport#yts[WidevineHFRTestsWidevineHFRPlaybackPerformancePlaybackPerfH264.720p.MQ.60fps@1.25X-13.2.45.1] |
ASSUMPTION_FAILURE
|
org.junit.AssumptionViolatedException: Test not enforced
|
| com.google.android.apps.yts.tvts.YtsReport#yts[WidevineHFRTestsWidevineHFRPlaybackPerformancePlaybackPerfH264.720p.MQ.60fps@1.5X-13.2.46.1] |
ASSUMPTION_FAILURE
|
org.junit.AssumptionViolatedException: Test not enforced
|
| com.google.android.apps.yts.tvts.YtsReport#yts[WidevineHFRTestsWidevineHFRPlaybackPerformancePlaybackPerfH264.720p.MQ.60fps@1.75X-13.2.47.1] |
ASSUMPTION_FAILURE
|
org.junit.AssumptionViolatedException: Test not enforced
|
| com.google.android.apps.yts.tvts.YtsReport#yts[WidevineHFRTestsWidevineHFRPlaybackPerformancePlaybackPerfH264.720p.MQ.60fps@1X-13.2.44.1] |
ASSUMPTION_FAILURE
|
org.junit.AssumptionViolatedException: Test not enforced
|
| com.google.android.apps.yts.tvts.YtsReport#yts[WidevineHFRTestsWidevineHFRPlaybackPerformancePlaybackPerfH264.720p.MQ.60fps@2X-13.2.48.1] |
ASSUMPTION_FAILURE
|
org.junit.AssumptionViolatedException: Test not enforced
|
| com.google.android.apps.yts.tvts.YtsReport#yts[WidevineHFRTestsWidevineHFRPlaybackPerformancePlaybackPerfVP9.1080p.60fps@0.25X-13.2.17.1] |
ASSUMPTION_FAILURE
|
org.junit.AssumptionViolatedException: Test not enforced
|
| com.google.android.apps.yts.tvts.YtsReport#yts[WidevineHFRTestsWidevineHFRPlaybackPerformancePlaybackPerfVP9.1080p.60fps@0.5X-13.2.18.1] |
ASSUMPTION_FAILURE
|
org.junit.AssumptionViolatedException: Test not enforced
|
| com.google.android.apps.yts.tvts.YtsReport#yts[WidevineHFRTestsWidevineHFRPlaybackPerformancePlaybackPerfVP9.1080p.60fps@0.75X-13.2.19.1] |
ASSUMPTION_FAILURE
|
org.junit.AssumptionViolatedException: Test not enforced
|
| com.google.android.apps.yts.tvts.YtsReport#yts[WidevineHFRTestsWidevineHFRPlaybackPerformancePlaybackPerfVP9.1080p.60fps@1.25X-13.2.21.1] |
ASSUMPTION_FAILURE
|
org.junit.AssumptionViolatedException: Test not enforced
|
| com.google.android.apps.yts.tvts.YtsReport#yts[WidevineHFRTestsWidevineHFRPlaybackPerformancePlaybackPerfVP9.1080p.60fps@1.5X-13.2.22.1] |
ASSUMPTION_FAILURE
|
org.junit.AssumptionViolatedException: Test not enforced
|
| com.google.android.apps.yts.tvts.YtsReport#yts[WidevineHFRTestsWidevineHFRPlaybackPerformancePlaybackPerfVP9.1080p.60fps@1.75X-13.2.23.1] |
ASSUMPTION_FAILURE
|
org.junit.AssumptionViolatedException: Test not enforced
|
| com.google.android.apps.yts.tvts.YtsReport#yts[WidevineHFRTestsWidevineHFRPlaybackPerformancePlaybackPerfVP9.1080p.60fps@1X-13.2.20.1] |
ASSUMPTION_FAILURE
|
org.junit.AssumptionViolatedException: Test not enforced
|
| com.google.android.apps.yts.tvts.YtsReport#yts[WidevineHFRTestsWidevineHFRPlaybackPerformancePlaybackPerfVP9.1080p.60fps@2X-13.2.24.1] |
ASSUMPTION_FAILURE
|
org.junit.AssumptionViolatedException: Test not enforced
|
| com.google.android.apps.yts.tvts.YtsReport#yts[WidevineHFRTestsWidevineHFRPlaybackPerformancePlaybackPerfVP9.1080p.MQ.60fps@0.25X-13.2.25.1] |
ASSUMPTION_FAILURE
|
org.junit.AssumptionViolatedException: Test not enforced
|
| com.google.android.apps.yts.tvts.YtsReport#yts[WidevineHFRTestsWidevineHFRPlaybackPerformancePlaybackPerfVP9.1080p.MQ.60fps@0.5X-13.2.26.1] |
ASSUMPTION_FAILURE
|
org.junit.AssumptionViolatedException: Test not enforced
|
| com.google.android.apps.yts.tvts.YtsReport#yts[WidevineHFRTestsWidevineHFRPlaybackPerformancePlaybackPerfVP9.1080p.MQ.60fps@0.75X-13.2.27.1] |
ASSUMPTION_FAILURE
|
org.junit.AssumptionViolatedException: Test not enforced
|
| com.google.android.apps.yts.tvts.YtsReport#yts[WidevineHFRTestsWidevineHFRPlaybackPerformancePlaybackPerfVP9.1080p.MQ.60fps@1.25X-13.2.29.1] |
ASSUMPTION_FAILURE
|
org.junit.AssumptionViolatedException: Test not enforced
|
| com.google.android.apps.yts.tvts.YtsReport#yts[WidevineHFRTestsWidevineHFRPlaybackPerformancePlaybackPerfVP9.1080p.MQ.60fps@1.5X-13.2.30.1] |
ASSUMPTION_FAILURE
|
org.junit.AssumptionViolatedException: Test not enforced
|
| com.google.android.apps.yts.tvts.YtsReport#yts[WidevineHFRTestsWidevineHFRPlaybackPerformancePlaybackPerfVP9.1080p.MQ.60fps@1.75X-13.2.31.1] |
ASSUMPTION_FAILURE
|
org.junit.AssumptionViolatedException: Test not enforced
|
| com.google.android.apps.yts.tvts.YtsReport#yts[WidevineHFRTestsWidevineHFRPlaybackPerformancePlaybackPerfVP9.1080p.MQ.60fps@1X-13.2.28.1] |
ASSUMPTION_FAILURE
|
org.junit.AssumptionViolatedException: Test not enforced
|
| com.google.android.apps.yts.tvts.YtsReport#yts[WidevineHFRTestsWidevineHFRPlaybackPerformancePlaybackPerfVP9.1080p.MQ.60fps@2X-13.2.32.1] |
ASSUMPTION_FAILURE
|
org.junit.AssumptionViolatedException: Test not enforced
|
| com.google.android.apps.yts.tvts.YtsReport#yts[WidevineHFRTestsWidevineHFRPlaybackPerformancePlaybackPerfVP9.720p.60fps@0.25X-13.2.1.1] |
ASSUMPTION_FAILURE
|
org.junit.AssumptionViolatedException: Test not enforced
|
| com.google.android.apps.yts.tvts.YtsReport#yts[WidevineHFRTestsWidevineHFRPlaybackPerformancePlaybackPerfVP9.720p.60fps@0.5X-13.2.2.1] |
ASSUMPTION_FAILURE
|
org.junit.AssumptionViolatedException: Test not enforced
|
| com.google.android.apps.yts.tvts.YtsReport#yts[WidevineHFRTestsWidevineHFRPlaybackPerformancePlaybackPerfVP9.720p.60fps@0.75X-13.2.3.1] |
ASSUMPTION_FAILURE
|
org.junit.AssumptionViolatedException: Test not enforced
|
| com.google.android.apps.yts.tvts.YtsReport#yts[WidevineHFRTestsWidevineHFRPlaybackPerformancePlaybackPerfVP9.720p.60fps@1.25X-13.2.5.1] |
ASSUMPTION_FAILURE
|
org.junit.AssumptionViolatedException: Test not enforced
|
| com.google.android.apps.yts.tvts.YtsReport#yts[WidevineHFRTestsWidevineHFRPlaybackPerformancePlaybackPerfVP9.720p.60fps@1.5X-13.2.6.1] |
ASSUMPTION_FAILURE
|
org.junit.AssumptionViolatedException: Test not enforced
|
| com.google.android.apps.yts.tvts.YtsReport#yts[WidevineHFRTestsWidevineHFRPlaybackPerformancePlaybackPerfVP9.720p.60fps@1.75X-13.2.7.1] |
ASSUMPTION_FAILURE
|
org.junit.AssumptionViolatedException: Test not enforced
|
| com.google.android.apps.yts.tvts.YtsReport#yts[WidevineHFRTestsWidevineHFRPlaybackPerformancePlaybackPerfVP9.720p.60fps@1X-13.2.4.1] |
ASSUMPTION_FAILURE
|
org.junit.AssumptionViolatedException: Test not enforced
|
| com.google.android.apps.yts.tvts.YtsReport#yts[WidevineHFRTestsWidevineHFRPlaybackPerformancePlaybackPerfVP9.720p.60fps@2X-13.2.8.1] |
ASSUMPTION_FAILURE
|
org.junit.AssumptionViolatedException: Test not enforced
|
| com.google.android.apps.yts.tvts.YtsReport#yts[WidevineHFRTestsWidevineHFRPlaybackPerformancePlaybackPerfVP9.720p.MQ.60fps@0.25X-13.2.9.1] |
ASSUMPTION_FAILURE
|
org.junit.AssumptionViolatedException: Test not enforced
|
| com.google.android.apps.yts.tvts.YtsReport#yts[WidevineHFRTestsWidevineHFRPlaybackPerformancePlaybackPerfVP9.720p.MQ.60fps@0.5X-13.2.10.1] |
ASSUMPTION_FAILURE
|
org.junit.AssumptionViolatedException: Test not enforced
|
| com.google.android.apps.yts.tvts.YtsReport#yts[WidevineHFRTestsWidevineHFRPlaybackPerformancePlaybackPerfVP9.720p.MQ.60fps@0.75X-13.2.11.1] |
ASSUMPTION_FAILURE
|
org.junit.AssumptionViolatedException: Test not enforced
|
| com.google.android.apps.yts.tvts.YtsReport#yts[WidevineHFRTestsWidevineHFRPlaybackPerformancePlaybackPerfVP9.720p.MQ.60fps@1.25X-13.2.13.1] |
ASSUMPTION_FAILURE
|
org.junit.AssumptionViolatedException: Test not enforced
|
| com.google.android.apps.yts.tvts.YtsReport#yts[WidevineHFRTestsWidevineHFRPlaybackPerformancePlaybackPerfVP9.720p.MQ.60fps@1.5X-13.2.14.1] |
ASSUMPTION_FAILURE
|
org.junit.AssumptionViolatedException: Test not enforced
|
| com.google.android.apps.yts.tvts.YtsReport#yts[WidevineHFRTestsWidevineHFRPlaybackPerformancePlaybackPerfVP9.720p.MQ.60fps@1.75X-13.2.15.1] |
ASSUMPTION_FAILURE
|
org.junit.AssumptionViolatedException: Test not enforced
|
| com.google.android.apps.yts.tvts.YtsReport#yts[WidevineHFRTestsWidevineHFRPlaybackPerformancePlaybackPerfVP9.720p.MQ.60fps@1X-13.2.12.1] |
ASSUMPTION_FAILURE
|
org.junit.AssumptionViolatedException: Test not enforced
|
| com.google.android.apps.yts.tvts.YtsReport#yts[WidevineHFRTestsWidevineHFRPlaybackPerformancePlaybackPerfVP9.720p.MQ.60fps@2X-13.2.16.1] |
ASSUMPTION_FAILURE
|
org.junit.AssumptionViolatedException: Test not enforced
|
| com.google.android.apps.yts.tvts.TvtsYouTubeTS#testYTS |
fail
|
java.lang.AssertionError: Test run incomplete. 60 YouTube tests were not run
|